α-Chlorophenylacetyl chloride
- Formula: C8H6Cl2O
- Molecular weight: 189.039
- IUPAC Standard InChIKey: FGEAOSXMQZWHIQ-UHFFFAOYSA-N
- CAS Registry Number: 2912-62-1
- Chemical structure:
View 3d structure (requires JavaScript / HTML 5) - Other names: a-Chlorophenylacetyl chloride; Benzeneacetyl chloride, α-chloro-; DL-2-Chloro-2-phenylacetyl chloride; chloro(phenyl)acetyl chloride

Phase change data

Data compiled by: Robert L. Brown and Stephen E. Stein
Reduced pressure boiling point
Tboil (K) | Pressure (bar) | Reference |
---|---|---|
393.2 | 0.031 | Weast and Grasselli, 1989 |
393. to 398. | 0.027 | Frinton Laboratories Inc., 1986 |

References

Weast and Grasselli, 1989
CRC Handbook of Data on Organic Compounds, 2nd Editon, Weast,R.C and Grasselli, J.G., ed(s)., CRC Press, Inc., Boca Raton, FL, 1989, 1. [all data]
Frinton Laboratories Inc., 1986
Frinton Laboratories Inc.,
Catalog Number 11, Frinton Laboratories Inc., Vineland, NJ, 1986, 99. [all data]