1,2,4,5-Tetrathiane

Van Den Dool and Kratz RI, non-polar column, temperature ramp

Data compiled by: NIST Mass Spectrometry Data Center, William E. Wallace, director

Column type CapillaryCapillary
Active phase DB-5OV-1
Column length (m) 30.50.
Carrier gas  H2
Substrate
Column diameter (mm) 0.320.2
Phase thickness (μm) 1.
Tstart (C) 60.50.
Tend (C) 250.280.
Heat rate (K/min) 4.4.
Initial hold (min) 5.
Final hold (min) 20.50.
I 1337.1310.
ReferenceMadruga and Mottram, 1998Chen and Ho, 1986
Comment MSDC-RI MSDC-RI

Normal alkane RI, non-polar column, temperature ramp

Data compiled by: NIST Mass Spectrometry Data Center, William E. Wallace, director

Column type Capillary
Active phase SPB-1
Column length (m) 30.
Carrier gas Helium
Substrate
Column diameter (mm) 0.25
Phase thickness (μm) 1.0
Tstart (C) 60.
Tend (C) 250.
Heat rate (K/min) 5.
Initial hold (min) 5.
Final hold (min)
I 1318.
ReferenceFrerot, Velluz, et al., 2008
Comment MSDC-RI

References

Madruga and Mottram, 1998
Madruga, M.S.; Mottram, D.S., The effect of pH on the formation of volatile compounds produced by heating a model system containing 5'-imp and cysteine, J. Braz. Chem. Soc., 1998, 9, 3, 261-271, https://doi.org/10.1590/S0103-50531998000300010 . [all data]

Chen and Ho, 1986
Chen, C.-C.; Ho, C.-T., Identification of sulfurous compounds of shiitake mushroom (Lentinus edodes Sing.), J. Agric. Food Chem., 1986, 34, 5, 830-833, https://doi.org/10.1021/jf00071a016 . [all data]