Methane-d tribromo-
- Formula: CDBr3
- Molecular weight: 253.737
- IUPAC Standard InChIKey: DIKBFYAXUHHXCS-MICDWDOJSA-N
- CAS Registry Number: 2909-52-6
- Chemical structure:
View 3d structure (requires JavaScript / HTML 5) - Isotopologues:
- Other names: tribromo(2H)methane; Tribromomethane-d1

Vibrational and/or electronic energy levels

Data compiled by: Takehiko Shimanouchi
Symmetry: C3ν Symmetry Number σ = 3
Sym. | No | Approximate | Selected Freq. | Infrared | Raman | Comments | ||||
---|---|---|---|---|---|---|---|---|---|---|
Species | type of mode | Value | Rating | Value | Phase | Value | Phase | |||
a1 | 1 | CD str | 2251 | C | 2251 M | liq. | 2247 | liq. | ||
a1 | 2 | CBr3 s-str | 521 | C | 521 M | liq. | 519.3 | liq. | ||
a1 | 3 | CBr3 s-deform | 222 | C | 221.6 | liq. | ||||
e | 4 | CD bend | 850 | D | 858 VS | liq. | 856.5 | liq. | FR(ν3+ν5) | |
e | 4 | CD bend | 850 | D | 844 VS | liq. | 840 | liq. | FR(ν3+ν5) | |
e | 5 | CBr3 d-str | 632 | C | 632 VS | liq. | 628.5 | liq. | ||
e | 6 | CBr3 d-deform | 153 | C | liq. | 153.4 | liq. | |||
Source: Shimanouchi, 1972

References

Shimanouchi, 1972
Shimanouchi, T.,
Tables of Molecular Vibrational Frequencies Consolidated Volume I, National Bureau of Standards, 1972, 1-160. [all data]