Propyl tert-butyl ether
- Formula: C7H16O
- Molecular weight: 116.2013
- IUPAC Standard InChIKey: FITVQUMLGWRKKG-UHFFFAOYSA-N
- CAS Registry Number: 29072-93-3
- Chemical structure:
View 3d structure (requires JavaScript / HTML 5) - Other names: Propane, 2-methyl-2-propoxy-

Phase change data

Data compiled as indicated in comments:
TRC - Thermodynamics Research Center, NIST Boulder Laboratories, Chris Muzny director
AC - William E. Acree, Jr., James S. Chickos
Quantity | Value | Units | Method | Reference | Comment |
---|---|---|---|---|---|
Tboil | 370.6 | K | N/A | Norris and Rigby, 1932 | Uncertainty assigned by TRC = 0.3 K; TRC |
Quantity | Value | Units | Method | Reference | Comment |
ΔvapH° | 38.3 | kJ/mol | CGC | Verevkin, Krasnykh, et al., 2003 | See also Verevkin, 2002 and Verevkin, Krasnykh, et al., 2003.; AC |
ΔvapH° | 37.2 ± 0.6 | kJ/mol | EB | Varushchenko, Pashchenko, et al., 2002 | Based on data from 315. to 370. K.; AC |
ΔvapH° | 36.6 ± 0.2 | kJ/mol | C | Varushchenko, Pashchenko, et al., 2002 | See also Dorofeeva, Yungman, et al., 2004.; AC |
Enthalpy of fusion
ΔfusH (kJ/mol) | Temperature (K) | Reference | Comment |
---|---|---|---|
9.87 | 179.6 | Varushchenko, Druzhinina, et al., 2001 | See also Dorofeeva, Yungman, et al., 2004.; AC |

Kovats' RI, non-polar column, isothermal

Column type | Active phase | Temperature (C) | I | Reference | Comment |
---|---|---|---|---|---|
Capillary | Methyl Silicone | 100. | 704.4 | Boneva and Toromanova-Petrova, 1994 | Column length: 50. m; Column diameter: 0.25 mm |
Capillary | Methyl Silicone | 90. | 704.0 | Boneva and Toromanova-Petrova, 1994 | Column length: 50. m; Column diameter: 0.25 mm |

Normal alkane RI, non-polar column, isothermal

Column type | Active phase | Temperature (C) | I | Reference | Comment |
---|---|---|---|---|---|
Capillary | DB-5 | 60. | 710. | Verevkin, Krasnykh, et al., 2003 | 60. m/0.32 mm/0.25 μm, Nitrogen |

References

Norris and Rigby, 1932
Norris, J.F.; Rigby, G.W.,
Reactivity of Atoms and Groups in Organic Compounds XII. The Preparation and Properties of Mixed Aliphatic Ethers with Special Reference to those Containing the Tert-Butyl Radical,
J. Am. Chem. Soc., 1932, 54, 2088. [all data]
Verevkin, Krasnykh, et al., 2003
Verevkin, Sergey P.; Krasnykh, Eugen L.; Vasiltsova, Tatiana V.; Heintz, Andreas,
Determination of Ambient Temperature Vapor Pressures and Vaporization Enthalpies of Branched Ethers,
J. Chem. Eng. Data, 2003, 48, 3, 591-599, https://doi.org/10.1021/je0255980
. [all data]
Verevkin, 2002
Verevkin, Sergey P.,
Improved Benson Increments for the Estimation of Standard Enthalpies of Formation and Enthalpies of Vaporization of Alkyl Ethers, Acetals, Ketals, and Ortho Esters,
J. Chem. Eng. Data, 2002, 47, 5, 1071-1097, https://doi.org/10.1021/je020023o
. [all data]
Varushchenko, Pashchenko, et al., 2002
Varushchenko, R.M.; Pashchenko, L.L.; Druzhinina, A.I.; Churkina, A.Yu.; Vorob'ev, I.I.; Kravchun, S.N.,
Zh. Fiz. Khim., 2002, 76, 4, 632. [all data]
Dorofeeva, Yungman, et al., 2004
Dorofeeva, O.V.; Yungman, V.S.; Varushchenko, R.M.; Druzhinina, A.I.,
Ideal Gas Thermodynamic Properties of Propyl tert-Butyl Ethers from Density Functional Theory Results Combined with Experimental Data,
International Journal of Thermophysics, 2004, 25, 4, 1097-1113, https://doi.org/10.1023/B:IJOT.0000038503.77644.a4
. [all data]
Varushchenko, Druzhinina, et al., 2001
Varushchenko, R.M.; Druzhinina, A.I.; Churkina, A.Yu.; Zhi, C.-T.,
Zh. Fiz. Khim., 2001, 75, 8, 1351. [all data]
Boneva and Toromanova-Petrova, 1994
Boneva, S.; Toromanova-Petrova, P.,
Capillary gas chromatography of C1-C4 alkyl tert-butyl ethers,
Chromatographia, 1994, 39, 3/4, 224-227, https://doi.org/10.1007/BF02274504
. [all data]