ethene-d2

Phase change data

Data compiled by: Thermodynamics Research Center, NIST Boulder Laboratories, Chris Muzny director

Quantity Value Units Method Reference Comment
Ttriple104.56KN/AKruis, 1948Uncertainty assigned by TRC = 0.03 K

In addition to the Thermodynamics Research Center (TRC) data available from this site, much more physical and chemical property data is available from the following TRC products:

References

Kruis, 1948
Kruis, A., Low-temperature research: v. specific heat, heat of fusion, heat of vaporization, and entropy of ethylene-1,1-d(2)., Z. Naturforsch., A: Astrophys., Phys., Phys. Chem., 1948, 3, 596-602. [all data]