[1,1'-bicyclohexyl]-1-ol
- Formula: C12H22O
- Molecular weight: 182.3025
- IUPAC Standard InChIKey: PVSNMDAHWMHSBD-UHFFFAOYSA-N
- CAS Registry Number: 2903-12-0
- Chemical structure:

Phase change data

Data compiled by: Thermodynamics Research Center, NIST Boulder Laboratories, Chris Muzny director
Quantity | Value | Units | Method | Reference | Comment |
---|---|---|---|---|---|
Tfus | 324. | K | N/A | Signaigo and Cramer, 1933 | Uncertainty assigned by TRC = 3. K |

References

Signaigo and Cramer, 1933
Signaigo, F.K.; Cramer, P.L.,
The preparation of some mono- and dialkylcylohexanes,
J. Am. Chem. Soc., 1933, 55, 3326-32. [all data]