Phenol, 2-(phenylmethyl)-
- Formula: C13H12O
- Molecular weight: 184.2338
- IUPAC Standard InChIKey: CDMGNVWZXRKJNS-UHFFFAOYSA-N
- CAS Registry Number: 28994-41-4
- Chemical structure:
View 3d structure (requires JavaScript / HTML 5) - Other names: o-Cresol, α-phenyl-; α-Phenyl-o-cresol; (2-Hydroxydiphenyl)methane; o-Benzylphenol; Delegol T; 2-Benzylphenol; 2-(Phenylmethyl)phenol

Gas phase thermochemistry data

Data compiled by: Hussein Y. Afeefy, Joel F. Liebman, and Stephen E. Stein
Quantity | Value | Units | Method | Reference | Comment |
---|---|---|---|---|---|
ΔfH°gas | 49.71 | kJ/mol | Ccb | Bertholon, Giray, et al., 1971 |

Condensed phase thermochemistry data

Data compiled by: Hussein Y. Afeefy, Joel F. Liebman, and Stephen E. Stein
Quantity | Value | Units | Method | Reference | Comment |
---|---|---|---|---|---|
ΔfH°solid | -67. | kJ/mol | Ccb | Bertholon, Giray, et al., 1971 | |
Quantity | Value | Units | Method | Reference | Comment |
ΔcH°solid | -6761. | kJ/mol | Ccb | Bertholon, Giray, et al., 1971 | Corresponding ΔfHºsolid = -71. kJ/mol (simple calculation by NIST; no Washburn corrections) |

Phase change data

Data compiled as indicated in comments:
BS - Robert L. Brown and Stephen E. Stein
TRC - Thermodynamics Research Center, NIST Boulder Laboratories, Chris Muzny director
ALS - Hussein Y. Afeefy, Joel F. Liebman, and Stephen E. Stein
DRB - Donald R. Burgess, Jr.
AC - William E. Acree, Jr., James S. Chickos
Quantity | Value | Units | Method | Reference | Comment |
---|---|---|---|---|---|
Tboil | 585.2 | K | N/A | Weast and Grasselli, 1989 | BS |
Tboil | 585. | K | N/A | Buckingham and Donaghy, 1982 | BS |
Tboil | 578. | K | N/A | Foeldi, 1928 | Uncertainty assigned by TRC = 6. K; TRC |
Quantity | Value | Units | Method | Reference | Comment |
Tfus | 325. | K | N/A | Buckingham and Donaghy, 1982 | BS |
Quantity | Value | Units | Method | Reference | Comment |
ΔsubH° | 116.6 | kJ/mol | C | Bertholon, Giray, et al., 1971 | ALS |
ΔsubH° | 116.7 | kJ/mol | N/A | Bertholon, Giray, et al., 1971 | DRB |
Reduced pressure boiling point
Tboil (K) | Pressure (bar) | Reference | Comment |
---|---|---|---|
448. | 0.024 | Buckingham and Donaghy, 1982 | BS |
Enthalpy of fusion
ΔfusH (kJ/mol) | Temperature (K) | Method | Reference | Comment |
---|---|---|---|---|
23.4 | 325.7 | DSC | Murthy, Paikaray, et al., 1995 | AC |

References

Bertholon, Giray, et al., 1971
Bertholon, G.; Giray, M.; Perrin, R.; Vincent-Falquet-Berny, M.F.,
No. 532. - Etude physicochimique des phenols. OX. - Ethanlpies de combustion et energies de resonance des alcoyl et aryphenols,
Bull. Soc. Chim. France, 1971, 3180-3187. [all data]
Weast and Grasselli, 1989
CRC Handbook of Data on Organic Compounds, 2nd Editon, Weast,R.C and Grasselli, J.G., ed(s)., CRC Press, Inc., Boca Raton, FL, 1989, 1. [all data]
Buckingham and Donaghy, 1982
Buckingham, J.; Donaghy, S.M.,
Dictionary of Organic Compounds: Fifth Edition, Chapman and Hall, New York, 1982, 1. [all data]
Foeldi, 1928
Foeldi, Z.,
Introduction of the Benzyk Group into the Benzene Nucleus with the Aid of Sulfonic Acid Esters,
Chem. Ber., 1928, 61B, 1609-16. [all data]
Murthy, Paikaray, et al., 1995
Murthy, S.S.N.; Paikaray, A.; Arya, N.,
Molecular relaxation and excess entropy in liquids and their connection to the structure of glass,
J. Chem. Phys., 1995, 102, 20, 8213, https://doi.org/10.1063/1.469232
. [all data]