DL-Phenylalanine, TMS derivative
- Formula: C12H19NO2Si
- Molecular weight: 237.3703
- IUPAC Standard InChIKey: NBXFAHHUVWSAFQ-UHFFFAOYSA-N
- CAS Registry Number: 2899-42-5
- Chemical structure:
View 3d structure (requires JavaScript / HTML 5) - Other names: Alanine, phenyl-, trimethylsilyl ester, dl-; DL-Phenylalanine, trimethylsilyl ester; d5-phenylalanine, mono-TMS; Phe, mono-TMS

Van Den Dool and Kratz RI, non-polar column, temperature ramp

Column type | Active phase | I | Reference | Comment |
---|---|---|---|---|
Capillary | DB-5 | 1559. | Fu, Iga, et al., 2000 | 30. m/0.25 mm/0.25 μm, He, 100. C @ 1. min, 10. K/min, 290. C @ 8. min |

Van Den Dool and Kratz RI, non-polar column, custom temperature program

Column type | Active phase | I | Reference | Comment |
---|---|---|---|---|
Capillary | VF-5MS | 1554.4 | Tret'yakov, 2007 | 30. m/0.25 mm/0.25 μm, He; Program: Multi-step temperature program; T(initial)=60C; T(final)=270C |

Normal alkane RI, non-polar column, temperature ramp

Column type | Active phase | I | Reference | Comment |
---|---|---|---|---|
Capillary | HP-5MS | 1563. | Lee, Yanamandra, et al., 2002 | 30. m/0.25 mm/0.25 μm, He, 70. C @ 3. min, 4. K/min, 280. C @ 3. min |

References

Fu, Iga, et al., 2000
Fu, X.; Iga, M.; Kimura, M.; Yamaguchi, S.,
Simplified screening for organic acidemia using GC/MS and dried urine filter paper: a study on neonatal mass screening,
Early Hum. Dev., 2000, 58, 1, 41-55, https://doi.org/10.1016/S0378-3782(00)00053-0
. [all data]
Tret'yakov, 2007
Tret'yakov, K.V.,
Retention Data. NIST Mass Spectrometry Data Center., NIST Mass Spectrometry Data Center, 2007. [all data]
Lee, Yanamandra, et al., 2002
Lee, B.Y.; Yanamandra, K.; Thurmon, T.F.,
Quantitative estimation of organic analytes with a capillary column,
Am. Clin. Lab., 2002, May, 30-34. [all data]