Methanone, [5-chloro-2-[(cyclopropylmethyl)amino]phenyl]phenyl-
- Formula: C17H16ClNO
- Molecular weight: 285.768
- IUPAC Standard InChIKey: WCRKZICZCPHVAB-UHFFFAOYSA-N
- CAS Registry Number: 2897-00-9
- Chemical structure:
View 3d structure (requires JavaScript / HTML 5) - Other names: 2-(Cyclopropyl-methyl)amino-5-chlor-benzophenone; 2-[(Cyclopropylmethyl)amino]-5-chlorobenzophenone; Benzophenone, 2-cyclopropylmethylamino-5-chloro; Benzophenone, 5-chloro-2-cyclopropylmethylamino; Prazepam, hydrolysis

Kovats' RI, non-polar column, isothermal

Column type | Active phase | Temperature (C) | I | Reference | Comment |
---|---|---|---|---|---|
Capillary | BP-1 | 200. | 2349. | Japp, Garthwaite, et al., 1988 | 25. m/0.22 mm/0.25 μm, N2 |
Packed | SE-30 | 220. | 2370. | Schütz, 1982 | N2 |
Packed | SE-30 | 250. | 2398. | Schütz, 1982 | N2 |

Kovats' RI, non-polar column, temperature ramp

Column type | Active phase | I | Reference | Comment |
---|---|---|---|---|
Capillary | Cross-Linked Methylsilicone | 2410. | Maurer and Pfleger, 1987 | 12. m/0.2 mm/0.33 μm, He, 100. C @ 3. min, 30. K/min, 310. C @ 5. min |

Normal alkane RI, non-polar column, custom temperature program

Column type | Active phase | I | Reference | Comment |
---|---|---|---|---|
Capillary | HP-5MS | 2410. | Augsburger, Rivier, et al., 1998 | 30. m/0.25 mm/0.25 μm; Program: not specified |
Other | Methyl Silicone | 2385. | Ardrey and Moffat, 1981 | Program: not specified |
Other | Methyl Silicone | 2407. | Ardrey and Moffat, 1981 | Program: not specified |

References

Japp, Garthwaite, et al., 1988
Japp, M.; Garthwaite, K.; Geeson, A.V.; Osselton, M.D.,
Collection of Analytical Data for Benzodiazepines and Benzophenones,
J. Chromatogr., 1988, 439, 2, 317-339, https://doi.org/10.1016/S0021-9673(01)83844-9
. [all data]
Schütz, 1982
Schütz, H.,
Benzodiazepines, Springer-Verlag, New York, 1982, 438. [all data]
Maurer and Pfleger, 1987
Maurer, H.; Pfleger, K.,
Identification and differentiation of benzodiazepines and their metabolites in urine by computerized gas chromatography-mass spectrometry,
J. Chromatogr., 1987, 422, 85-101, https://doi.org/10.1016/0378-4347(87)80442-5
. [all data]
Augsburger, Rivier, et al., 1998
Augsburger, M.; Rivier, L.; Mangin, P.,
Comparison of different immunoassays and GC-MS screening of benzodiazepines in urine,
J. Pharm. Biomed. Anal., 1998, 18, 4-5, 681-687, https://doi.org/10.1016/S0731-7085(98)00266-0
. [all data]
Ardrey and Moffat, 1981
Ardrey, R.E.; Moffat, A.C.,
Gas-liquid chromatographic retention indices of 1318 substances of toxicological interest on SE-30 or OV-1 stationary phase,
J. Chromatogr., 1981, 220, 3, 195-252, https://doi.org/10.1016/S0021-9673(00)81925-1
. [all data]