3,4-di-n-Butoxy-3-cyclobutene-1,2-dione
- Formula: C12H18O4
- Molecular weight: 226.2689
- IUPAC Standard InChIKey: XBRWELTXMQSEIN-UHFFFAOYSA-N
- CAS Registry Number: 2892-62-8
- Chemical structure:
View 3d structure (requires JavaScript / HTML 5) - Other names: Dibutyl squarate; 3,4-Dibutoxy-3-cyclobutene-1,2-dione

Phase change data

Data compiled by: Robert L. Brown and Stephen E. Stein
Reduced pressure boiling point
Tboil (K) | Pressure (bar) | Reference |
---|---|---|
412.2 | 0.0007 | Aldrich Chemical Company Inc., 1990 |
427. to 431. | 0.004 | Frinton Laboratories Inc., 1986 |

References

Aldrich Chemical Company Inc., 1990
Aldrich Chemical Company Inc.,
Catalog Handbook of Fine Chemicals, Aldrich Chemical Company, Inc., Milwaukee WI, 1990, 1. [all data]
Frinton Laboratories Inc., 1986
Frinton Laboratories Inc.,
Catalog Number 11, Frinton Laboratories Inc., Vineland, NJ, 1986, 99. [all data]