1-Oxa-3,4-diazacyclopentadiene
- Formula: C2H2N2O
- Molecular weight: 70.0501
- IUPAC Standard InChIKey: FKASFBLJDCHBNZ-UHFFFAOYSA-N
- CAS Registry Number: 288-99-3
- Chemical structure:
View 3d structure (requires JavaScript / HTML 5) - Other names: 1,3,4-Oxadiazole

Normal alkane RI, non-polar column, custom temperature program

Column type | Active phase | I | Reference | Comment |
---|---|---|---|---|
Capillary | Methyl Silicone | 817. | Zenkevich, 1996 | Program: not specified |

References

Zenkevich, 1996
Zenkevich, I.G.,
Informational Maitenance of Gas Chromatographic Identification of Organic Compounds in Ecoanalytical Investigations,
Z. Anal. Chem., 1996, 51, 11, 1140-1148. [all data]