Thiazole
- Formula: C3H3NS
- Molecular weight: 85.128
- IUPAC Standard InChIKey: FZWLAAWBMGSTSO-UHFFFAOYSA-N
- CAS Registry Number: 288-47-1
- Chemical structure:
View 3d structure (requires JavaScript / HTML 5) - Other names: 1,3-Thiazole

Condensed phase thermochemistry data

Data compiled by: Eugene S. Domalski and Elizabeth D. Hearing
Quantity | Value | Units | Method | Reference | Comment |
---|---|---|---|---|---|
S°liquid | 169.95 | J/mol*K | N/A | Soulie, Goursot, et al., 1969 | |
S°liquid | 169.95 | J/mol*K | N/A | Goursot and Westrum, 1968 |
Constant pressure heat capacity of liquid
Cp,liquid (J/mol*K) | Temperature (K) | Reference | Comment |
---|---|---|---|
121.00 | 298.15 | Soulie, Goursot, et al., 1969 | T = 4 to 350 K. |
121.00 | 298.15 | Goursot and Westrum, 1968 | T = 5 to 340 K. Glass transition 145 to 175 K. |

Phase change data

Data compiled as indicated in comments:
BS - Robert L. Brown and Stephen E. Stein
TRC - Thermodynamics Research Center, NIST Boulder Laboratories, Chris Muzny director
AC - William E. Acree, Jr., James S. Chickos
DH - Eugene S. Domalski and Elizabeth D. Hearing
Quantity | Value | Units | Method | Reference | Comment |
---|---|---|---|---|---|
Tboil | 390.7 | K | N/A | Weast and Grasselli, 1989 | BS |
Tboil | 391.39 | K | N/A | Soulie, Bares, et al., 1975 | Uncertainty assigned by TRC = 0.2 K; calculated from Antoine equations based on obs. data; TRC |
Quantity | Value | Units | Method | Reference | Comment |
Tfus | 239.58 | K | N/A | Meyer and Metzger, 1966 | Uncertainty assigned by TRC = 0.05 K; TRC |
Quantity | Value | Units | Method | Reference | Comment |
Ttriple | 239.53 | K | N/A | Soulie, Goursot, et al., 1969, 2 | Uncertainty assigned by TRC = 0.02 K; TRC |
Ttriple | 239.48 | K | N/A | Goursot and Westrum, 1968, 2 | Uncertainty assigned by TRC = 0.02 K; TRC |
Enthalpy of vaporization
ΔvapH (kJ/mol) | Temperature (K) | Method | Reference | Comment |
---|---|---|---|---|
39.7 | 348. | A | Stephenson and Malanowski, 1987 | Based on data from 333. to 393. K.; AC |
38.9 | 351. | A | Stephenson and Malanowski, 1987 | Based on data from 336. to 391. K. See also Soulie, Goursot, et al., 1969, 3.; AC |
Antoine Equation Parameters
log10(P) = A − (B / (T + C))
P = vapor pressure (bar)
T = temperature (K)
View plot Requires a JavaScript / HTML 5 canvas capable browser.
Temperature (K) | A | B | C | Reference | Comment |
---|---|---|---|---|---|
336.13 to 391.41 | 4.26547 | 1424.453 | -56.993 | Soulie, Goursot, et al., 1969, 4 | Coefficents calculated by NIST from author's data. |
Enthalpy of fusion
ΔfusH (kJ/mol) | Temperature (K) | Reference | Comment |
---|---|---|---|
9.5397 | 239.53 | Soulie, Goursot, et al., 1969 | DH |
9.590 | 239.48 | Goursot and Westrum, 1968 | DH |
9.58 | 239.4 | Goursot, Westrum, et al., 1968 | See also Meyer and Metzger, 1966.; AC |
Entropy of fusion
ΔfusS (J/mol*K) | Temperature (K) | Reference | Comment |
---|---|---|---|
40.04 | 239.53 | Soulie, Goursot, et al., 1969 | DH |
40.04 | 239.48 | Goursot and Westrum, 1968 | DH |

Van Den Dool and Kratz RI, polar column, temperature ramp

Data compiled by: NIST Mass Spectrometry Data Center, William E. Wallace, director

Column type CapillaryCapillaryCapillaryCapillaryCapillary
Active phase CP-Wax 52CBFFAPDB-WaxSupelcowax-10DB-Wax
Column length (m) 50.30.60.60.60.
Carrier gas  HeHeHeHe
Substrate
Column diameter (mm) 0.320.250.250.250.25
Phase thickness (μm)  0.250.250.250.25
Tstart (C) 60.40.40.35.50.
Tend (C) 220.220.200.195.230.
Heat rate (K/min) 4.5.2.2.3.
Initial hold (min) 5.3.5.5.
Final hold (min) 30. 30.90.
I 1238.1210.1244.1252.1265.
ReferenceMahadevan and Farmer, 2006Calvo-Gómez, Morales-López, et al., 2004Kim, 2001Chung, 1999Shimoda, Peralta, et al., 1996
Comment MSDC-RI MSDC-RI MSDC-RI MSDC-RI MSDC-RI
Column type Capillary
Active phase DB-Wax
Column length (m) 60.
Carrier gas He
Substrate
Column diameter (mm) 0.25
Phase thickness (μm)
Tstart (C) 60.
Tend (C) 220.
Heat rate (K/min) 3.
Initial hold (min) 4.
Final hold (min) 30.
I 1249.
ReferenceChung, Eiserich, et al., 1994
Comment MSDC-RI

Normal alkane RI, polar column, custom temperature program

Data compiled by: NIST Mass Spectrometry Data Center, William E. Wallace, director

Column type CapillaryCapillaryCapillaryCapillary
Active phase DB-WaxDB-WaxDB-WaxCarbowax 20M
Column length (m) 30.30.60.
Carrier gas HydrogenHydrogenHelium
Substrate
Column diameter (mm) 0.250.250.25
Phase thickness (μm) 0.250.250.25
Program 44 0C 3 0C/min -> 170 0C 8 0C/min -> 250 0Cnot specified60 0C (3 min) 2 0C/min -> 150 0C 4 0C/min -> 200 0Cnot specified
I 1262.1260.1246.1246.
ReferenceGonzalez-Rios, Suarez-Quiroz, et al., 2007Gonzalez-Rios, Suarez-Quiroz, et al., 2007Kim. J.H., Ahn, et al., 2004Vinogradov, 2004
Comment MSDC-RI MSDC-RI MSDC-RI MSDC-RI

Van Den Dool and Kratz RI, non-polar column, custom temperature program

Data compiled by: NIST Mass Spectrometry Data Center, William E. Wallace, director

Column type CapillaryCapillaryCapillaryCapillary
Active phase SPB-5CP-Sil 8CB-MSDB-5BPX-5
Column length (m) 30.60.50.50.
Carrier gas  HeHeHe
Substrate
Column diameter (mm) 0.530.250.320.32
Phase thickness (μm) 1.50.250.50.5
Program 40C(1min) => 6C/min => 180C => 20C/min => 280C0C(5min) => 40C/min => 40C (2min) => 4C/min => 280CoC(5min) => 60C/min => 60C (5min) => 4C/min => 250C0C(5min) => 40C/min => 40C(2min) => 4C/min => 280C
I 694.740.735.760.
ReferenceMajcher and Jelen, 2007Elmore, Mottram, et al., 2000Parker, Hassell, et al., 2000Elmore, Mottram, et al., 1999
Comment MSDC-RI MSDC-RI MSDC-RI MSDC-RI

Gas phase ion energetics data

Data evaluated as indicated in comments:
HL - Edward P. Hunter and Sharon G. Lias

Data compiled as indicated in comments:
LLK - Sharon G. Lias, Rhoda D. Levin, and Sherif A. Kafafi

Quantity Value Units Method Reference Comment
Proton affinity (review)216.kcal/molN/AHunter and Lias, 1998HL
Quantity Value Units Method Reference Comment
Gas basicity208.4kcal/molN/AHunter and Lias, 1998HL

Ionization energy determinations

IE (eV) Method Reference Comment
9.50PEDaamen, Oskam, et al., 1979Vertical value; LLK

Van Den Dool and Kratz RI, polar column, custom temperature program

Data compiled by: NIST Mass Spectrometry Data Center, William E. Wallace, director

Column type Capillary
Active phase Supelcowax-10
Column length (m) 30.
Carrier gas He
Substrate
Column diameter (mm) 0.25
Phase thickness (μm) 0.25
Program 35C(8min) => 4C/min => 60C => 6C/min => 160C => 20C/min => 200C(1min)
I 1262.
ReferenceBianchi, Careri, et al., 2007
Comment MSDC-RI

References

Soulie, Goursot, et al., 1969
Soulie, M.A.; Goursot, P.; Peneloux, A.; Metzger, J.,
Properties thermochimiques du thiazole,
J. chim. Phys. physicochim. Biol., 1969, 66, 603-606. [all data]
Goursot and Westrum, 1968
Goursot, P.; Westrum, E.F., Jr.,
Heat capacity and thermodynamic functions of thiazole from 5 to 340K,
J. Chem. Eng. Data, 1968, 13, 471-475. [all data]
Weast and Grasselli, 1989
CRC Handbook of Data on Organic Compounds, 2nd Editon, Weast,R.C and Grasselli, J.G., ed(s)., CRC Press, Inc., Boca Raton, FL, 1989, 1. [all data]
Soulie, Bares, et al., 1975
Soulie, M.A.; Bares, D.; Metzger, J.,
Vapor Pressures of Some Azaaromatic Compounds,
C. R. Seances Acad. Sci., Ser. C, 1975, 281, 341. [all data]
Meyer and Metzger, 1966
Meyer, R.; Metzger, J.,
C. R. Acad. Sci. Paris, Ser. C, 1966, 263, 1333. [all data]
Soulie, Goursot, et al., 1969, 2
Soulie, M.A.; Goursot, P.; Peneloux, A.; Metzger, J.,
Thermodynamic properties of thiazole,
J. Chim. Phys. Phys.-Chim. Biol., 1969, 66, 603-6. [all data]
Goursot and Westrum, 1968, 2
Goursot, P.; Westrum, E.F.,
Heat capacity and thermodynamic functions of thiazole from 5 to 340 K,
J. Chem. Eng. Data, 1968, 13, 471. [all data]
Stephenson and Malanowski, 1987
Stephenson, Richard M.; Malanowski, Stanislaw,
Handbook of the Thermodynamics of Organic Compounds, 1987, https://doi.org/10.1007/978-94-009-3173-2
. [all data]
Soulie, Goursot, et al., 1969, 3
Soulie, M.A.; Goursot, P.; Peneloux, A.; Metzger, J.,
J. Chim. Phys. Phys.-Chim. Biol., 1969, 66, 4, 603. [all data]
Soulie, Goursot, et al., 1969, 4
Soulie, M.A.; Goursot, P.; Peneloux, A.; Metzger, J.,
Proprietes Thermochimiques du Thiazole,
J. Chim. Phys. Phys. Chim. Biol., 1969, 66, 603-610. [all data]
Goursot, Westrum, et al., 1968
Goursot, P.; Westrum, E.F., Jr.; Metzger, J.,
C. R. Acad. Sci. Paris, Ser. C, 1968, 266, 590. [all data]