Nonane, 2,3-dimethyl-
- Formula: C11H24
- Molecular weight: 156.3083
- IUPAC Standard InChIKey: IGJRNTLDWLTHCQ-UHFFFAOYSA-N
- CAS Registry Number: 2884-06-2
- Chemical structure:
View 3d structure (requires JavaScript / HTML 5) - Other names: 2,3-Dimethylnonane

Phase change data

Data compiled as indicated in comments:
TRC - Thermodynamics Research Center, NIST Boulder Laboratories, Chris Muzny director
AC - William E. Acree, Jr., James S. Chickos
Quantity | Value | Units | Method | Reference | Comment |
---|---|---|---|---|---|
Tboil | 448. | K | N/A | Krafft, 1882 | Uncertainty assigned by TRC = 12. K; TRC |
Enthalpy of vaporization
ΔvapH (kJ/mol) | Temperature (K) | Method | Reference | Comment |
---|---|---|---|---|
45.1 | 351. | A | Stephenson and Malanowski, 1987 | Based on data from 336. to 460. K.; AC |

References

Krafft, 1882
Krafft, F.,
On Nineteen Higher Normal Paraffins and a Simple Volume Law for Liquids that form Drops I.,
Ber. Dtsch. Chem. Ges., 1882, 15, 1687-711. [all data]
Stephenson and Malanowski, 1987
Stephenson, Richard M.; Malanowski, Stanislaw,
Handbook of the Thermodynamics of Organic Compounds, 1987, https://doi.org/10.1007/978-94-009-3173-2
. [all data]