1,6-Heptadien-4-ol
- Formula: C7H12O
- Molecular weight: 112.1696
- IUPAC Standard InChIKey: UTGFOWQYZKTZTN-UHFFFAOYSA-N
- CAS Registry Number: 2883-45-6
- Chemical structure:
View 3d structure (requires JavaScript / HTML 5) - Other names: hepta-1,6-dien-4-ol

Phase change data

Data compiled by: Robert L. Brown and Stephen E. Stein
Quantity | Value | Units | Method | Reference | Comment |
---|---|---|---|---|---|
Tboil | 424.2 | K | N/A | Aldrich Chemical Company Inc., 1990 |

Van Den Dool and Kratz RI, polar column, custom temperature program

Column type | Active phase | I | Reference | Comment |
---|---|---|---|---|
Capillary | Supelcowax-10 | 1330. | Howard, Mike, et al., 2005 | 30. m/0.25 mm/0.25 μm, He; Program: 35C(8min) => 3C/min => 134C => 20C/min => 250C(3.2min) |

Normal alkane RI, non-polar column, temperature ramp

Column type | Active phase | I | Reference | Comment |
---|---|---|---|---|
Capillary | OV-101 | 876. | Zenkevich, 2005 | 25. m/0.20 mm/0.10 μm, N2/He, 6. K/min; Tstart: 50. C; Tend: 250. C |

References

Aldrich Chemical Company Inc., 1990
Aldrich Chemical Company Inc.,
Catalog Handbook of Fine Chemicals, Aldrich Chemical Company, Inc., Milwaukee WI, 1990, 1. [all data]
Howard, Mike, et al., 2005
Howard, K.L.; Mike, J.H.; Riesen, R.,
Validation of a Solid-Phase Microextraction Method for Headspace Analysis of Wine Aroma Components,
Am. J. Enol. Vitic, 2005, 56, 1, 37-45. [all data]
Zenkevich, 2005
Zenkevich, I.G.,
Experimentally measured retention indices., 2005. [all data]