1H-Imidazole
- Formula: C3H4N2
- Molecular weight: 68.0773
- IUPAC Standard InChIKey: RAXXELZNTBOGNW-UHFFFAOYSA-N
- CAS Registry Number: 288-32-4
- Chemical structure:
View 3d structure (requires JavaScript / HTML 5) - Other names: Imidazole; Glyoxalin; Glyoxaline; Imidazol; Imutex; Methanimidamide, N,N'-1,2-ethenediyl-; Miazole; 1,3-Diaza-2,4-cyclopentadiene; 1,3-Diazole; Formamidine, N,N'-vinylene-; Iminazole; IMD; Pyrro(b)monazole; USAF EK-4733; NSC 60522

Gas phase thermochemistry data

Data compiled as indicated in comments:
DRB - Donald R. Burgess, Jr.
ALS - Hussein Y. Afeefy, Joel F. Liebman, and Stephen E. Stein
Quantity | Value | Units | Method | Reference | Comment |
---|---|---|---|---|---|
ΔfH°gas | 129.5 | kJ/mol | N/A | Zaheeruddin and Lodhi, 1991 | Value computed using ΔfHsolid° value of 60.0 kj/mol from Zaheeruddin and Lodhi, 1991 and ΔsubH° value of 69.5 kj/mol from Jimenez, Roux, et al., 1987.; DRB |
ΔfH°gas | 139.3 ± 1.9 | kJ/mol | Cm | Guthrie and Pike, 1987 | Heat of hydrolysis; ALS |
ΔfH°gas | 132.9 ± 0.6 | kJ/mol | Ccb | Jimenez, Roux, et al., 1987 | see Jimenez, Roux, et al., 1986; ALS |
ΔfH°gas | 128. ± 7.5 | kJ/mol | Ccb | Bedford, Edmondson, et al., 1962 | ALS |

Condensed phase thermochemistry data

Data compiled as indicated in comments:
ALS - Hussein Y. Afeefy, Joel F. Liebman, and Stephen E. Stein
DH - Eugene S. Domalski and Elizabeth D. Hearing
Quantity | Value | Units | Method | Reference | Comment |
---|---|---|---|---|---|
ΔfH°solid | Ccb | Zaheeruddin and Lodhi, 1991 | uncertain value: 59.96 kJ/mol; ALS | ||
ΔfH°solid | 49.8 ± 0.6 | kJ/mol | Ccb | Jimenez, Roux, et al., 1987 | see Jimenez, Roux, et al., 1986; ALS |
ΔfH°solid | 58.5 ± 3.3 | kJ/mol | Ccb | Bedford, Edmondson, et al., 1962 | Reanalyzed by Cox and Pilcher, 1970, Original value = 61. ± 3. kJ/mol; ALS |
Quantity | Value | Units | Method | Reference | Comment |
ΔcH°solid | Ccb | Zaheeruddin and Lodhi, 1991 | uncertain value: -1812.17 kJ/mol; ALS | ||
ΔcH°solid | -1801.9 ± 0.5 | kJ/mol | Ccb | Jimenez, Roux, et al., 1987 | see Jimenez, Roux, et al., 1986; ALS |
ΔcH°solid | -1810.6 ± 3.3 | kJ/mol | Ccb | Bedford, Edmondson, et al., 1962 | Reanalyzed by Cox and Pilcher, 1970, Original value = -1813.1 ± 3.3 kJ/mol; ALS |
ΔcH°solid | -1802. | kJ/mol | Ccb | Zimmerman and Geisenfelder, 1961 | ALS |
Constant pressure heat capacity of solid
Cp,solid (J/mol*K) | Temperature (K) | Reference | Comment |
---|---|---|---|
82.4 | 298.15 | Jimenez, Roux, et al., 1987 | Cp given as 1.21 J/g*K.; DH |
89.78 | 300. | DeWit, DeKruif, et al., 1983 | T = 90 to 370 K.; DH |
94.4 | 310. | DeWit, Offringa, et al., 1983 | T = 300 to 450 K.; DH |

Phase change data

Data compiled as indicated in comments:
BS - Robert L. Brown and Stephen E. Stein
TRC - Thermodynamics Research Center, NIST Boulder Laboratories, Chris Muzny director
ALS - Hussein Y. Afeefy, Joel F. Liebman, and Stephen E. Stein
DRB - Donald R. Burgess, Jr.
AC - William E. Acree, Jr., James S. Chickos
DH - Eugene S. Domalski and Elizabeth D. Hearing
Quantity | Value | Units | Method | Reference | Comment |
---|---|---|---|---|---|
Tboil | 530.2 | K | N/A | Weast and Grasselli, 1989 | BS |
Quantity | Value | Units | Method | Reference | Comment |
Tfus | 363.7 | K | N/A | Hilgeman, Mouroux, et al., 1989 | Uncertainty assigned by TRC = 0.4 K; TRC |
Tfus | 361.9 | K | N/A | De Wit, Offringa, et al., 1983 | Uncertainty assigned by TRC = 0.2 K; TRC |
Quantity | Value | Units | Method | Reference | Comment |
Ttriple | 362.69 | K | N/A | De Wit, De Kruif, et al., 1983 | Uncertainty assigned by TRC = 0.02 K; TRC |
Quantity | Value | Units | Method | Reference | Comment |
ΔsubH° | 79. ± 10. | kJ/mol | AVG | N/A | Average of 8 values; Individual data points |
Enthalpy of sublimation
ΔsubH (kJ/mol) | Temperature (K) | Method | Reference | Comment |
---|---|---|---|---|
83.1 ± 0.2 | 300. | ME | Jimenez, Roux, et al., 1987 | Based on data from 292. to 309. K.; AC |
80.8 | 301. | ME,TE | De Wit, Van Miltenburg, et al., 1983 | Based on data from 288. to 310. K.; AC |
Enthalpy of fusion
ΔfusH (kJ/mol) | Temperature (K) | Reference | Comment |
---|---|---|---|
12.500 | 363.7 | Hilgeman, Mouroux, et al., 1989, 2 | DH |
12.821 | 362.69 | DeWit, DeKruif, et al., 1983 | DH |
12.800 | 361.9 | DeWit, Offringa, et al., 1983 | DH |
12.8 | 361.9 | Domalski and Hearing, 1996 | See also De Wit, De Kruif, et al., 1983, 2.; AC |
Entropy of fusion
ΔfusS (J/mol*K) | Temperature (K) | Reference | Comment |
---|---|---|---|
35.35 | 362.69 | DeWit, DeKruif, et al., 1983 | DH |
35.37 | 361.9 | DeWit, Offringa, et al., 1983 | DH |

Reaction thermochemistry data

Data compiled as indicated in comments:
B - John E. Bartmess
RCD - Robert C. Dunbar
M - Michael M. Meot-Ner (Mautner) and Sharon G. Lias
ALS - Hussein Y. Afeefy, Joel F. Liebman, and Stephen E. Stein
Individual Reactions
By formula: C3H3N2- + H+ = C3H4N2
Quantity | Value | Units | Method | Reference | Comment |
---|---|---|---|---|---|
ΔrH° | 1464.1 ± 3.0 | kJ/mol | G+TS | Gianola, Ichino, et al., 2005 | gas phase; B |
ΔrH° | 1465. ± 8.8 | kJ/mol | G+TS | Taft, Anvia, et al., 1986 | gas phase; value altered from reference due to change in acidity scale; B |
Quantity | Value | Units | Method | Reference | Comment |
ΔrG° | 1433.4 ± 1.7 | kJ/mol | IMRE | Gianola, Ichino, et al., 2005 | gas phase; B |
ΔrG° | 1434. ± 8.4 | kJ/mol | IMRE | Taft, Anvia, et al., 1986 | gas phase; value altered from reference due to change in acidity scale; B |
By formula: Na+ + C3H4N2 = (Na+ • C3H4N2)
Quantity | Value | Units | Method | Reference | Comment |
---|---|---|---|---|---|
ΔrH° | 140. ± 5.0 | kJ/mol | CIDT | Huang and Rodgers, 2002 | RCD |
ΔrH° | 140. ± 5.4 | kJ/mol | CIDT | Armentrout and Rodgers, 2000 | RCD |
ΔrH° | 140. ± 5.0 | kJ/mol | CIDT | Rodgers and Armentrout, 1999 | RCD |
By formula: C3H3N2- + C3H4N2 = (C3H3N2- • C3H4N2)
Quantity | Value | Units | Method | Reference | Comment |
---|---|---|---|---|---|
ΔrH° | 110. | kJ/mol | PHPMS | Meot-Ner (Mautner), 1988 | gas phase; M |
Quantity | Value | Units | Method | Reference | Comment |
ΔrS° | 123. | J/mol*K | PHPMS | Meot-Ner (Mautner), 1988 | gas phase; M |
By formula: C3H4N2+ + C3H4N2 = (C3H4N2+ • C3H4N2)
Quantity | Value | Units | Method | Reference | Comment |
---|---|---|---|---|---|
ΔrH° | 99.2 | kJ/mol | PHPMS | Meot-Ner (Mautner), 1988 | gas phase; M |
Quantity | Value | Units | Method | Reference | Comment |
ΔrS° | 90.8 | J/mol*K | PHPMS | Meot-Ner (Mautner), 1988 | gas phase; M |
By formula: C4H12N+ + C3H4N2 = (C4H12N+ • C3H4N2)
Quantity | Value | Units | Method | Reference | Comment |
---|---|---|---|---|---|
ΔrH° | 94.6 | kJ/mol | PHPMS | Meot-Ner (Mautner), 1988 | gas phase; M |
Quantity | Value | Units | Method | Reference | Comment |
ΔrS° | 88.7 | J/mol*K | PHPMS | Meot-Ner (Mautner), 1988 | gas phase; M |
By formula: C2H3O2- + C3H4N2 = (C2H3O2- • C3H4N2)
Quantity | Value | Units | Method | Reference | Comment |
---|---|---|---|---|---|
ΔrH° | 116. | kJ/mol | PHPMS | Meot-Ner (Mautner), 1988 | gas phase; M |
Quantity | Value | Units | Method | Reference | Comment |
ΔrS° | 102. | J/mol*K | PHPMS | Meot-Ner (Mautner), 1988 | gas phase; M |
By formula: C5H6N2O + H2O = C3H4N2 + C2H4O2
Quantity | Value | Units | Method | Reference | Comment |
---|---|---|---|---|---|
ΔrH° | -20.2 ± 0.2 | kJ/mol | Cm | Wadso, 1960 | liquid phase; solvent: Aqueous; Heat of hydrolysis; ALS |
By formula: C9H16N2O2 + H2O = C4H8O2 + C3H4N2 + C2H6O
Quantity | Value | Units | Method | Reference | Comment |
---|---|---|---|---|---|
ΔrH° | -44.69 ± 0.67 | kJ/mol | Cm | Guthrie and Pike, 1987 | liquid phase; Heat of hydrolysis; ALS |
By formula: C12H14N2O2 + H2O = C3H4N2 + CH4O + C8H8O2
Quantity | Value | Units | Method | Reference | Comment |
---|---|---|---|---|---|
ΔrH° | -55.48 ± 0.71 | kJ/mol | Cm | Guthrie and Pike, 1987 | liquid phase; Heat of hydrolysis; ALS |
By formula: C8H14N2O2 + H2O = C3H6O2 + C3H4N2 + C2H6O
Quantity | Value | Units | Method | Reference | Comment |
---|---|---|---|---|---|
ΔrH° | -34.6 ± 1.8 | kJ/mol | Cm | Guthrie and Pike, 1987 | liquid phase; Heat of hydrolysis; ALS |
By formula: C4H11N + C5H6N2O = C6H13NO + C3H4N2
Quantity | Value | Units | Method | Reference | Comment |
---|---|---|---|---|---|
ΔrH° | -75.6 ± 0.3 | kJ/mol | Cm | Wadso, 1962 | solid phase; ALS |
By formula: Li+ + C3H4N2 = (Li+ • C3H4N2)
Quantity | Value | Units | Method | Reference | Comment |
---|---|---|---|---|---|
ΔrH° | 211. ± 9.6 | kJ/mol | CIDT | Huang and Rodgers, 2002 | RCD |
By formula: K+ + C3H4N2 = (K+ • C3H4N2)
Quantity | Value | Units | Method | Reference | Comment |
---|---|---|---|---|---|
ΔrH° | 109. ± 5.4 | kJ/mol | CIDT | Huang and Rodgers, 2002 | RCD |

Gas phase ion energetics data

Data evaluated as indicated in comments:
HL - Edward P. Hunter and Sharon G. Lias
L - Sharon G. Lias
Data compiled as indicated in comments:
B - John E. Bartmess
LBLHLM - Sharon G. Lias, John E. Bartmess, Joel F. Liebman, John L. Holmes, Rhoda D. Levin, and W. Gary Mallard
LLK - Sharon G. Lias, Rhoda D. Levin, and Sherif A. Kafafi
Quantity | Value | Units | Method | Reference | Comment |
---|---|---|---|---|---|
IE (evaluated) | 8.81 ± 0.01 | eV | N/A | N/A | L |
Quantity | Value | Units | Method | Reference | Comment |
Proton affinity (review) | 942.8 | kJ/mol | N/A | Hunter and Lias, 1998 | HL |
Quantity | Value | Units | Method | Reference | Comment |
Gas basicity | 909.2 | kJ/mol | N/A | Hunter and Lias, 1998 | HL |
Ionization energy determinations
IE (eV) | Method | Reference | Comment |
---|---|---|---|
8.81 ± 0.01 | PI | Main-Bobo, Loesik, et al., 1986 | LBLHLM |
9.12 | EI | Klebe, Houte, et al., 1972 | LLK |
8.96 | PE | Ramsey, 1979 | Vertical value; LLK |
8.78 | PE | Cradock, Findlay, et al., 1973 | Vertical value; LLK |
Appearance energy determinations
Ion | AE (eV) | Other Products | Method | Reference | Comment |
---|---|---|---|---|---|
CH2N+ | 11.67 ± 0.05 | C2H2N | PI | Main-Bobo, Loesik, et al., 1986 | LBLHLM |
C2H2N+ | 13.2 | HCN | EI | Klebe, Houte, et al., 1972 | LLK |
C2H3N2+ | 11.48 ± 0.02 | CH | PI | Main-Bobo, Loesik, et al., 1986 | LBLHLM |
C3H3N2+ | 12.8 | H | EI | Klebe, Houte, et al., 1972 | LLK |
De-protonation reactions
By formula: C3H3N2- + H+ = C3H4N2
Quantity | Value | Units | Method | Reference | Comment |
---|---|---|---|---|---|
ΔrH° | 1464.1 ± 3.0 | kJ/mol | G+TS | Gianola, Ichino, et al., 2005 | gas phase; B |
ΔrH° | 1465. ± 8.8 | kJ/mol | G+TS | Taft, Anvia, et al., 1986 | gas phase; value altered from reference due to change in acidity scale; B |
Quantity | Value | Units | Method | Reference | Comment |
ΔrG° | 1433.4 ± 1.7 | kJ/mol | IMRE | Gianola, Ichino, et al., 2005 | gas phase; B |
ΔrG° | 1434. ± 8.4 | kJ/mol | IMRE | Taft, Anvia, et al., 1986 | gas phase; value altered from reference due to change in acidity scale; B |

Ion clustering data

Data compiled as indicated in comments:
M - Michael M. Meot-Ner (Mautner) and Sharon G. Lias
RCD - Robert C. Dunbar
Clustering reactions
By formula: C2H3O2- + C3H4N2 = (C2H3O2- • C3H4N2)
Quantity | Value | Units | Method | Reference | Comment |
---|---|---|---|---|---|
ΔrH° | 27.7 | kcal/mol | PHPMS | Meot-Ner (Mautner), 1988 | gas phase; M |
Quantity | Value | Units | Method | Reference | Comment |
ΔrS° | 24.4 | cal/mol*K | PHPMS | Meot-Ner (Mautner), 1988 | gas phase; M |
By formula: C3H3N2- + C3H4N2 = (C3H3N2- • C3H4N2)
Quantity | Value | Units | Method | Reference | Comment |
---|---|---|---|---|---|
ΔrH° | 26.4 | kcal/mol | PHPMS | Meot-Ner (Mautner), 1988 | gas phase; M |
Quantity | Value | Units | Method | Reference | Comment |
ΔrS° | 29.3 | cal/mol*K | PHPMS | Meot-Ner (Mautner), 1988 | gas phase; M |
By formula: C3H4N2+ + C3H4N2 = (C3H4N2+ • C3H4N2)
Quantity | Value | Units | Method | Reference | Comment |
---|---|---|---|---|---|
ΔrH° | 23.7 | kcal/mol | PHPMS | Meot-Ner (Mautner), 1988 | gas phase; M |
Quantity | Value | Units | Method | Reference | Comment |
ΔrS° | 21.7 | cal/mol*K | PHPMS | Meot-Ner (Mautner), 1988 | gas phase; M |
By formula: C4H12N+ + C3H4N2 = (C4H12N+ • C3H4N2)
Quantity | Value | Units | Method | Reference | Comment |
---|---|---|---|---|---|
ΔrH° | 22.6 | kcal/mol | PHPMS | Meot-Ner (Mautner), 1988 | gas phase; M |
Quantity | Value | Units | Method | Reference | Comment |
ΔrS° | 21.2 | cal/mol*K | PHPMS | Meot-Ner (Mautner), 1988 | gas phase; M |
By formula: K+ + C3H4N2 = (K+ • C3H4N2)
Quantity | Value | Units | Method | Reference | Comment |
---|---|---|---|---|---|
ΔrH° | 26.0 ± 1.3 | kcal/mol | CIDT | Huang and Rodgers, 2002 | RCD |
By formula: Li+ + C3H4N2 = (Li+ • C3H4N2)
Quantity | Value | Units | Method | Reference | Comment |
---|---|---|---|---|---|
ΔrH° | 50.4 ± 2.3 | kcal/mol | CIDT | Huang and Rodgers, 2002 | RCD |
By formula: Na+ + C3H4N2 = (Na+ • C3H4N2)
Quantity | Value | Units | Method | Reference | Comment |
---|---|---|---|---|---|
ΔrH° | 33.4 ± 1.2 | kcal/mol | CIDT | Huang and Rodgers, 2002 | RCD |
ΔrH° | 33.4 ± 1.3 | kcal/mol | CIDT | Armentrout and Rodgers, 2000 | RCD |
ΔrH° | 33.4 ± 1.2 | kcal/mol | CIDT | Rodgers and Armentrout, 1999 | RCD |

Kovats' RI, non-polar column, isothermal

Column type | Active phase | Temperature (C) | I | Reference | Comment |
---|---|---|---|---|---|
Capillary | OV-101 | 110. | 1069. | Zhuravleva, 2000 | 50. m/0.3 mm/0.4 μm, He |
Capillary | OV-101 | 110. | 1042. | Golovnya, Kuz'menko, et al., 1999 | 50. m/0.3 mm/0.4 μm, He |
Capillary | OV-101 | 150. | 1069. | Golovnya, Zhuravleva, et al., 1992 | 30. m/0.30 mm/0.20 μm |

Kovats' RI, non-polar column, custom temperature program

Column type | Active phase | I | Reference | Comment |
---|---|---|---|---|
Packed | SE-30 | 1095. | Ramsey, Lee, et al., 1980 | He, Chromosorb G HP (80-100 mesh); Column length: 1.5 m; Program: not specified |

Kovats' RI, polar column, isothermal

Column type | Active phase | Temperature (C) | I | Reference | Comment |
---|---|---|---|---|---|
Capillary | PEG-40M/KF | 170. | 2172. | Golovnya, Zhuravleva, et al., 1992 | 30. m/0.3 mm/0.2 μm |

Van Den Dool and Kratz RI, non-polar column, temperature ramp

Column type | Active phase | I | Reference | Comment |
---|---|---|---|---|
Packed | SE-30 | 1055. | Peng, Ding, et al., 1988 | He, Supelcoport and Chromosorb, 40. C @ 4. min, 10. K/min, 250. C @ 60. min; Column length: 3.05 m |

Normal alkane RI, non-polar column, custom temperature program

Column type | Active phase | I | Reference | Comment |
---|---|---|---|---|
Other | Methyl Silicone | 1095. | Ardrey and Moffat, 1981 | Program: not specified |

Normal alkane RI, polar column, temperature ramp

Column type | Active phase | I | Reference | Comment |
---|---|---|---|---|
Capillary | DB-Wax | 2200. | Wong and Bernhard, 1988 | He, 70. C @ 8. min, 2. K/min; Column length: 30. m; Column diameter: 0.25 mm; Tend: 160. C |

References

Zaheeruddin and Lodhi, 1991
Zaheeruddin, M.; Lodhi, Z.H.,
Enthalpies of formation of some cyclic compounds,
Phys. Chem. (Peshawar Pak.), 1991, 10, 111-118. [all data]
Jimenez, Roux, et al., 1987
Jimenez, P.; Roux, M.V.; Turrion, C.,
Thermochemical properties of N-heterocyclic compounds. I. Enthalpies of combustion, vapour pressures and enthalpies of sublimation, and enthalpies of formation of pyrazole, imidazole, indazole, and benzimidazole,
J. Chem. Thermodyn., 1987, 19, 985-992. [all data]
Guthrie and Pike, 1987
Guthrie, J.P.; Pike, D.C.,
Hydration of acylimidazoles: tetrahedral intermediates in acylimidazole hydrolysis and nucleophilic attack by imidazole on esters. The question of concerted mechanisms for acyl transfers,
Can. J. Chem., 1987, 65, 1951-1969. [all data]
Jimenez, Roux, et al., 1986
Jimenez, P.; Roux, M.V.; Turrion, C.; Gomis, F.,
Thermochemical properties of some N-heterocyclic compounds,
J. Calorim. Anal. Therm. Thermodyn. Chim., 1986, 17, 469-470. [all data]
Bedford, Edmondson, et al., 1962
Bedford, A.F.; Edmondson, P.B.; Mortimer, C.T.,
Heats of formation and bond energies. Part VI. n-Butyliso-butyraldimine, n-butylisobutylamine, pyrazole, and imidazole,
J. Chem. Soc., 1962, 2927-2931. [all data]
Cox and Pilcher, 1970
Cox, J.D.; Pilcher, G.,
Thermochemistry of Organic and Organometallic Compounds, Academic Press, New York, 1970, 1-636. [all data]
Zimmerman and Geisenfelder, 1961
Zimmerman, H.; Geisenfelder, H.,
Uber die Mesomerieenergie von Azolen,
Z. Electrochem., 1961, 65, 368-371. [all data]
DeWit, DeKruif, et al., 1983
DeWit, H.G.M.; DeKruif, C.G.; Van Miltenburg, J.C.,
Thermodynamic properties of molecular organic crystals containing organic crystals containing nitrogen, oxygen, and sulfur. II. Molar heat capacities of eight compounds by adiabatic calorimetry,
J. Chem. Thermodynam., 1983, 15, 891-902. [all data]
DeWit, Offringa, et al., 1983
DeWit, H.G.M.; Offringa, J.C.A.; De Kruif, C.G.; Van Miltenburg, J.C.,
Thermodynamic properties of molecular organic crystals containing nitrogen, oxygen and sulfur. III. Molar heat capacities measured by differential scanning calorimetry,
Thermochim. Acta, 1983, 65, 43-51. [all data]
Weast and Grasselli, 1989
CRC Handbook of Data on Organic Compounds, 2nd Editon, Weast,R.C and Grasselli, J.G., ed(s)., CRC Press, Inc., Boca Raton, FL, 1989, 1. [all data]
Hilgeman, Mouroux, et al., 1989
Hilgeman, F.R.; Mouroux, F.Y.N.; Mok, D.; Holan, M.K.,
Phase Diagrams of Binary Solid Azole Systems,
J. Chem. Eng. Data, 1989, 34, 220. [all data]
De Wit, Offringa, et al., 1983
De Wit, H.G.M.; Offringa, J.C.A.; De Kruif, C.G.; van Miltenburg, J.C.,
Thremodynamic properties of molecular organic crystals containing nitrogen, oxygen and sulfur. III. molar heat capacities measured by DSC. scanning calorimetry.,
Thermochim. Acta, 1983, 65, 43. [all data]
De Wit, De Kruif, et al., 1983
De Wit, H.G.M.; De Kruif, C.G.; Van Miltenburg, J.C.,
Thermodynamic properties of molecular organic crystals containing nitrogen, oxygen, and sulfur II. Molar heat capacities of eight compounds by adiabatic calorimetry,
J. Chem. Thermodyn., 1983, 15, 9, 891, https://doi.org/10.1016/0021-9614(83)90095-2
. [all data]
De Wit, Van Miltenburg, et al., 1983
De Wit, H.G.M.; Van Miltenburg, J.C.; De Kruif, C.G.,
Thermodynamic properties of molecular organic crystals containing nitrogen, oxygen, and sulphur 1. Vapour pressures and enthalpies of sublimation,
The Journal of Chemical Thermodynamics, 1983, 15, 7, 651-663, https://doi.org/10.1016/0021-9614(83)90079-4
. [all data]
Hilgeman, Mouroux, et al., 1989, 2
Hilgeman, F.R.; Mouroux, F.Y.N.; Mok, D.; Holan, M.K.,
Phase diagrams of binary solid azole systems,
J. Chem. Eng. Data, 1989, 34, 220-222. [all data]
Domalski and Hearing, 1996
Domalski, Eugene S.; Hearing, Elizabeth D.,
Heat Capacities and Entropies of Organic Compounds in the Condensed Phase. Volume III,
J. Phys. Chem. Ref. Data, 1996, 25, 1, 1, https://doi.org/10.1063/1.555985
. [all data]
De Wit, De Kruif, et al., 1983, 2
De Wit, H.G.M.; De Kruif, C.G.; Van Miltenburg, J.C.,
Thermodynamic properties of molecular organic crystals containing nitrogen, oxygen, and sulfur II. Molar heat capacities of eight compounds by adiabatic calorimetry,
The Journal of Chemical Thermodynamics, 1983, 15, 9, 891-902, https://doi.org/10.1016/0021-9614(83)90095-2
. [all data]
Gianola, Ichino, et al., 2005
Gianola, A.J.; Ichino, T.; Hoenigman, R.L.; Kato, S.; Bierbaum, V.M.; Lineberger, W.C.,
Photoelectron spectra and ion chemistry of imidazolide,
J. Phys. Chem. A, 2005, 109, 50, 11504-11514, https://doi.org/10.1021/jp053566o
. [all data]
Taft, Anvia, et al., 1986
Taft, R.W.; Anvia, F.; Taagepera, M.; Catalan, J.; Elgueroy, J.,
Electrostatic proximity effects in the relative basicities of pyrazole, imidazole, pyridazine, and pyrimidine,
J. Am. Chem. Soc., 1986, 108, 3237. [all data]
Huang and Rodgers, 2002
Huang, H.; Rodgers, M.T.,
Sigma versus Pi interactions in alkali metal ion binding to azoles: Threshold collision-induced dissociation and ab initio theory studies,
J. Phys. Chem. A, 2002, 106, 16, 4277, https://doi.org/10.1021/jp013630b
. [all data]
Armentrout and Rodgers, 2000
Armentrout, P.B.; Rodgers, M.T.,
An Absolute Sodium Cation Affinity Scale: Threshold Collision-Induced Dissociation Experiments and ab Initio Theory,
J. Phys. Chem A, 2000, 104, 11, 2238, https://doi.org/10.1021/jp991716n
. [all data]
Rodgers and Armentrout, 1999
Rodgers, M.T.; Armentrout, P.B.,
Absolute Alkali Metal Ion Binding Affinities of Several Azoles Determined by Threshold Collision-Induced Dissociation,
Int. J. Mass Spectrom. Ion Proc., 1999, 185/186/187, 359. [all data]
Meot-Ner (Mautner), 1988
Meot-Ner (Mautner), M.,
Models for Strong Interactions in Proteins and Enzymes. 2. Interactions of Ions with the Peptide Link and Imidazole,
J. Am. Chem. Soc., 1988, 110, 10, 3075, https://doi.org/10.1021/ja00218a014
. [all data]
Wadso, 1960
Wadso, I.,
Heats of hydrolysis of N-acetylated imidazole, 1,2,4-triazole and tetrazole,
Acta Chem. Scand., 1960, 14, 903-908. [all data]
Wadso, 1962
Wadso, I.,
Heats of aminolysis and hydrolysis of some N-acetyl compounds and of acetic anhydride,
Acta Chem. Scand., 1962, 16, 471-478. [all data]