Cyclohexane, (3-cyclopentylpropyl)-
- Formula: C14H26
- Molecular weight: 194.3562
- IUPAC Standard InChIKey: CPBZARXQRZTYGI-UHFFFAOYSA-N
- CAS Registry Number: 2883-07-0
- Chemical structure:
View 3d structure (requires JavaScript / HTML 5) - Other names: Propane, 1-cyclohexyl-3-cyclopentyl-; 1-Cyclohexyl-3-cyclopentylpropane

Phase change data

Data compiled as indicated in comments:
TRC - Thermodynamics Research Center, NIST Boulder Laboratories, Chris Muzny director
AC - William E. Acree, Jr., James S. Chickos
Quantity | Value | Units | Method | Reference | Comment |
---|---|---|---|---|---|
Tfus | 248.55 | K | N/A | Anonymous, 1968 | Uncertainty assigned by TRC = 0.5 K; TRC |
Tfus | 248.6 | K | N/A | Schiessler, 1947 | Uncertainty assigned by TRC = 1. K; TRC |
Enthalpy of vaporization
ΔvapH (kJ/mol) | Temperature (K) | Method | Reference | Comment |
---|---|---|---|---|
64.5 | 386. | A | Stephenson and Malanowski, 1987 | Based on data from 371. to 403. K.; AC |

References

Anonymous, 1968
Anonymous, R.,
Properties of hydrocarbon of high molecular weight, Am. Pet. Inst. Res. Proj. 42, Penn. State Univ., 1968. [all data]
Schiessler, 1947
Schiessler, R.W.,
, Am. Pet. Inst. Res. Proj. 42, Twelfth Meeting, 1947. [all data]
Stephenson and Malanowski, 1987
Stephenson, Richard M.; Malanowski, Stanislaw,
Handbook of the Thermodynamics of Organic Compounds, 1987, https://doi.org/10.1007/978-94-009-3173-2
. [all data]