Cyclopentane, nonyl-
- Formula: C14H28
- Molecular weight: 196.3721
- IUPAC Standard InChIKey: GDCYEUOAZVKNHT-UHFFFAOYSA-N
- CAS Registry Number: 2882-98-6
- Chemical structure:
View 3d structure (requires JavaScript / HTML 5) - Other names: n-Nonylcyclopentane; nonylcyclopentane; 1-Cyclopentylnonane

Gas phase thermochemistry data

Data compiled by: Hussein Y. Afeefy, Joel F. Liebman, and Stephen E. Stein
Quantity | Value | Units | Method | Reference | Comment |
---|---|---|---|---|---|
ΔfH°gas | -271.3 ± 2.1 | kJ/mol | Ccb | Prosen, Johnson, et al., 1946 | Heat of combustion of the gas |

Condensed phase thermochemistry data

Data compiled by: Hussein Y. Afeefy, Joel F. Liebman, and Stephen E. Stein
Quantity | Value | Units | Method | Reference | Comment |
---|---|---|---|---|---|
ΔcH°liquid | -9239.6 ± 1.9 | kJ/mol | Ccb | Prosen, Johnson, et al., 1946 | Heat of combustion of the gas; Corresponding ΔfHºliquid = -271.2 kJ/mol (simple calculation by NIST; no Washburn corrections) |

Phase change data

Data compiled by: William E. Acree, Jr., James S. Chickos
Quantity | Value | Units | Method | Reference | Comment |
---|---|---|---|---|---|
ΔvapH° | 70.7 | kJ/mol | N/A | Reid, 1972 |

Kovats' RI, non-polar column, isothermal

View large format table.

Column type Active phase Temperature (C) I Reference Comment
CapillaryOV-1100.1438.0Anders, Anders, et al., 198555. m/0.21 mm/0.35 μm, N2

Kovats' RI, non-polar column, custom temperature program

View large format table.

Column type Active phase I Reference Comment
CapillaryHP-5MS1451.Kenig, Simons, et al., 200530. m/0.25 mm/0.25 μm, He; Program: 60C(1.5min) => 20C/min => 130C => 4C/min => 315C (90min)

References

Prosen, Johnson, et al., 1946
Prosen, E.J.; Johnson, W.H.; Rossini, F.D.,
Heats of formation and combustion of the normal alkylcyclopentanes and cyclohexanes and the increment per CH2 group for several homologous series of hydrocarbons,
J. Res. NBS, 1946, 37, 51-56. [all data]
Reid, 1972
Reid, Robert C.,
Handbook on vapor pressure and heats of vaporization of hydrocarbons and related compounds, R. C. Wilhort and B. J. Zwolinski, Texas A Research Foundation. College Station, Texas(1971). 329 pages.$10.00,
AIChE J., 1972, 18, 6, 1278-1278, https://doi.org/10.1002/aic.690180637
. [all data]