Pentadecane, 3-methyl-
- Formula: C16H34
- Molecular weight: 226.4412
- IUPAC Standard InChIKey: FWXKCXJPHSAYMK-UHFFFAOYSA-N
- CAS Registry Number: 2882-96-4
- Chemical structure:
View 3d structure (requires JavaScript / HTML 5) - Other names: 3-Methylpentadecane

Phase change data

Data compiled as indicated in comments:
TRC - Thermodynamics Research Center, NIST Boulder Laboratories, Chris Muzny director
AC - William E. Acree, Jr., James S. Chickos
Quantity | Value | Units | Method | Reference | Comment |
---|---|---|---|---|---|
Tboil | 539.5 | K | N/A | Spengler, 1948 | Uncertainty assigned by TRC = 3. K; TRC |
Quantity | Value | Units | Method | Reference | Comment |
Tfus | 250.2 | K | N/A | Terres, Gebert, et al., 1954 | Uncertainty assigned by TRC = 2. K; TRC |
Tfus | 241.2 | K | N/A | Spengler, 1948 | Uncertainty assigned by TRC = 1. K; TRC |
Tfus | 250.9 | K | N/A | Lunshof, Van Steenis, et al., 1947 | Uncertainty assigned by TRC = 0.6 K; TRC |
Enthalpy of vaporization
ΔvapH (kJ/mol) | Temperature (K) | Method | Reference | Comment |
---|---|---|---|---|
61.0 | 432. | A | Stephenson and Malanowski, 1987 | Based on data from 417. to 555. K.; AC |

Kovats' RI, non-polar column, custom temperature program

Data compiled by: NIST Mass Spectrometry Data Center, William E. Wallace, director

Column type Capillary
Active phase HP-5MS
Column length (m) 30.
Carrier gas He
Substrate
Column diameter (mm) 0.25
Phase thickness (μm) 0.25
Program 60C(1.5min) => 20C/min => 130C => 4C/min => 315C (90min)
I 1570.
ReferenceKenig, Simons, et al., 2005
Comment MSDC-RI

Kovats' RI, non-polar column, isothermal

Data compiled by: NIST Mass Spectrometry Data Center, William E. Wallace, director

Column type Packed
Active phase OV-1
Column length (m) 4.
Carrier gas
Substrate Gas-Chrom Q
Column diameter (mm)
Phase thickness (μm)
Temperature (C) 160.
I 1572.
ReferenceBrown and Moore, 1979
Comment MSDC-RI

Van Den Dool and Kratz RI, non-polar column, temperature ramp

View large format table.

Column type Active phase I Reference Comment
CapillaryDB-Petro1568.6Pang T., Zhu S., et al., 200750. m/0.2 mm/0.5 μm, 2. K/min; Tstart: 50. C; Tend: 270. C
CapillaryDB-Petro1570.2Pang T., Zhu S., et al., 200750. m/0.2 mm/0.5 μm, 2. K/min; Tstart: 50. C; Tend: 270. C
CapillaryCross-Linked Methylsilicone1572.Khorasheh, Gray, et al., 19895. K/min; Tstart: 40. C; Tend: 300. C
CapillaryUltra-11571.46Haynes and Pitzer, 198550. m/0.22 mm/0.33 μm, He, 1. K/min; Tstart: -30. C; Tend: 240. C
CapillaryUltra-11571.82Haynes and Pitzer, 198550. m/0.22 mm/0.33 μm, He, 2. K/min; Tstart: -30. C; Tend: 240. C
CapillaryUltra-11572.06Haynes and Pitzer, 198550. m/0.22 mm/0.33 μm, He, 3. K/min; Tstart: -30. C; Tend: 240. C
CapillaryUltra-21570.93Haynes and Pitzer, 198550. m/0.22 mm/0.33 μm, He, 1. K/min; Tstart: -30. C; Tend: 240. C
CapillaryUltra-21571.48Haynes and Pitzer, 198550. m/0.22 mm/0.33 μm, He, 2. K/min; Tstart: -30. C; Tend: 240. C
CapillaryUltra-21571.51Haynes and Pitzer, 198550. m/0.22 mm/0.33 μm, He, 3. K/min; Tstart: -30. C; Tend: 240. C

Van Den Dool and Kratz RI, non-polar column, custom temperature program

View large format table.

Column type Active phase I Reference Comment
CapillaryDB-51570.Zaikin and Borisov, 2002He; Column length: 30. m; Column diameter: 0.25 mm; Program: 30C => 5K/min=120C => 10C/min => 270C

Normal alkane RI, non-polar column, temperature ramp

View large format table.

Column type Active phase I Reference Comment
CapillaryHP-5 MS1571.Radulovic, Blagojevic, et al., 201030. m/0.25 mm/0.25 μm, Helium, 5. K/min, 290. C @ 10. min; Tstart: 70. C
CapillaryOV-11572.7Krkosova, Kubinec, et al., 2007100. m/0.32 mm/0.25 μm, Helium, 5. K/min, 310. C @ 5. min; Tstart: 30. C
CapillaryHP-51566.Utsunomia, Kawata, et al., 200530. m/0.32 mm/0.25 μm, Helium, 4. K/min, 300. C @ 5. min; Tstart: 40. C
CapillaryDB-11574.Katritzky, Chen, et al., 200030. m/0.32 mm/0.25 μm; Tstart: 60. C; Tend: 320. C
CapillaryOV-11565.Ramaroson-Raonizafinimanana, Gaydou, et al., 199725. m/0.31 mm/0.15 μm, H2, 3. K/min; Tstart: 70. C; Tend: 220. C

Normal alkane RI, non-polar column, custom temperature program

View large format table.

Column type Active phase I Reference Comment
CapillaryPolydimethyl siloxane1574.Junkes, Castanho, et al., 2003Program: not specified
CapillarySqualane1569.Petrov, 1984Program: not specified
CapillaryApiezon L1569.Shlyakhov, 1984Program: not specified

References

Spengler, 1948
Spengler, G.,
Unpublished, Inst. Kohleforschung, Prague, Czechosl- ovakia (transmitted by L. L. Newman, U. S, 1948. [all data]
Terres, Gebert, et al., 1954
Terres, E.; Gebert, F.; Fischer, D.; Modak, G.,
Brennst.-Chem., 1954, 35, 263-9. [all data]
Lunshof, Van Steenis, et al., 1947
Lunshof; Van Steenis, J.; Waterman,
Recl. Trav. Chim. Pays-Bas, 1947, 66, 348. [all data]
Stephenson and Malanowski, 1987
Stephenson, Richard M.; Malanowski, Stanislaw,
Handbook of the Thermodynamics of Organic Compounds, 1987, https://doi.org/10.1007/978-94-009-3173-2
. [all data]