Ethyl-α-bromophenyl acetate
- Formula: C10H11BrO2
- Molecular weight: 243.097
- IUPAC Standard InChIKey: BKTKLDMYHTUESO-UHFFFAOYSA-N
- CAS Registry Number: 2882-19-1
- Chemical structure:
View 3d structure (requires JavaScript / HTML 5) - Other names: Benzeneacetic acid, α-bromo-, ethyl ester; Ethyl-alpha-bromophenyl acetate; ethyl bromophenylacetate

Phase change data

Data compiled by: Robert L. Brown and Stephen E. Stein
Reduced pressure boiling point
Tboil (K) | Pressure (bar) | Reference |
---|---|---|
421. to 423. | 0.024 | Frinton Laboratories Inc., 1986 |

References

Frinton Laboratories Inc., 1986
Frinton Laboratories Inc.,
Catalog Number 11, Frinton Laboratories Inc., Vineland, NJ, 1986, 99. [all data]