disodium acetylide

Reaction thermochemistry data

Data compiled by: José A. Martinho Simões

Individual Reactions

C2Na2 (cr) + 2Water (l) = 2(Sodium hydroxide • 1418Water) (solution) + Acetylene (g)

By formula: C2Na2 (cr) + 2H2O (l) = 2(HNaO • 1418H2O) (solution) + C2H2 (g)

Quantity Value Units Method Reference Comment
Δr-161.8 ± 1.5kJ/molRSCJohnson, van Deventer, et al., 1973Please also see Pedley and Rylance, 1977.

References

Johnson, van Deventer, et al., 1973
Johnson, G.K.; van Deventer, E.H.; Ackerman, J.P.; Hubbard, W.N.; Osborne, D.W.; Flotow, H.L., J. Chem. Thermodyn., 1973, 5, 57. [all data]

Pedley and Rylance, 1977
Pedley, J.B.; Rylance, J., Computer Analysed Thermochemical Data: Organic and Organometallic Compounds, University of Sussex, Brigton, 1977. [all data]