trans-dichloro-tetrakis(thiourea)cadmium(II)

Phase change data

Data compiled by: William E. Acree, Jr., James S. Chickos

Enthalpy of sublimation

ΔsubH (kJ/mol) Temperature (K) Reference
75. ± 20.377. - 405.Ashcroft, 1970

References

Ashcroft, 1970
Ashcroft, S.J., Thermochemistry of thiourea complexes of the type [M II (tu)4Cl2](M II = manganese, iron, cobalt, nickel, zinc, cadmium, and mercury), J. Chem. Soc., A, 1970, 1020, https://doi.org/10.1039/j19700001020 . [all data]