Benzoyl chloride, 4-butyl-
- Formula: C11H13ClO
- Molecular weight: 196.673
- IUPAC Standard InChIKey: OUOWCSJYDCPVDM-UHFFFAOYSA-N
- CAS Registry Number: 28788-62-7
- Chemical structure:
View 3d structure (requires JavaScript / HTML 5) - Other names: 4-Butylbenzoyl chloride; p-Butylbenzoyl chloride; 4-n-Butylbenzoyl chloride

Phase change data

Data compiled by: Robert L. Brown and Stephen E. Stein
Reduced pressure boiling point
Tboil (K) | Pressure (bar) | Reference |
---|---|---|
428.7 | 0.029 | Weast and Grasselli, 1989 |

Van Den Dool and Kratz RI, non-polar column, custom temperature program

Column type | Active phase | I | Reference | Comment |
---|---|---|---|---|
Capillary | VF-5MS | 1522. | Tretyakov, 2011 | 30. m/0.25 mm/0.25 μm, He; Program: Multi-step temperature program; T(initial)=60C; T(final)=270C |

References

Weast and Grasselli, 1989
CRC Handbook of Data on Organic Compounds, 2nd Editon, Weast,R.C and Grasselli, J.G., ed(s)., CRC Press, Inc., Boca Raton, FL, 1989, 1. [all data]
Tretyakov, 2011
Tretyakov, K.V.,
Retention Data. NIST Mass Spectrometry Data Center., NIST Mass Spectrometry Data Center, 2011. [all data]