1-octylnaphthalene
- Formula: C18H24
- Molecular weight: 240.3832
- IUPAC Standard InChIKey: MZOGBVZHJWAQSG-UHFFFAOYSA-N
- CAS Registry Number: 2876-51-9
- Chemical structure:
View 3d structure (requires JavaScript / HTML 5) - Permanent link for this species. Use this link for bookmarking this species for future reference.

Phase change data

Data compiled by: Thermodynamics Research Center, NIST Boulder Laboratories, Chris Muzny director
Quantity | Value | Units | Method | Reference | Comment |
---|---|---|---|---|---|
Tboil | 615. | K | N/A | Luther, 1955 | Uncertainty assigned by TRC = 6. K |

References

Luther, 1955
Luther, H.,
Private Communication 1955, 1955. [all data]