Naphthalene, 2-hexyl-
- Formula: C16H20
- Molecular weight: 212.3300
- IUPAC Standard InChIKey: ZGHJVWFEQWVPTB-UHFFFAOYSA-N
- CAS Registry Number: 2876-46-2
- Chemical structure:
View 3d structure (requires JavaScript / HTML 5) - Other names: 2-Hexylnaphthalene

Phase change data

Data compiled by: Thermodynamics Research Center, NIST Boulder Laboratories, Chris Muzny director
Quantity | Value | Units | Method | Reference | Comment |
---|---|---|---|---|---|
Tboil | 596. | K | N/A | Romadane, 1957 | Uncertainty assigned by TRC = 5. K |
Tboil | 578. | K | N/A | Luther, 1955 | Uncertainty assigned by TRC = 8. K |
Tboil | 596.7 | K | N/A | Anderson, Smith, et al., 1953 | Uncertainty assigned by TRC = 3. K |
Tboil | 596.7 | K | N/A | Bailey, Pickering, et al., 1949 | Uncertainty assigned by TRC = 3. K |
Quantity | Value | Units | Method | Reference | Comment |
Tfus | 280.0 | K | N/A | Luther, 1955 | Uncertainty assigned by TRC = 3. K |
Tfus | 267.6 | K | N/A | Bailey, Pickering, et al., 1949 | Uncertainty assigned by TRC = 2. K |
Tfus | 266.3 | K | N/A | Koelbel, 1949 | Uncertainty assigned by TRC = 1.5 K |

References

Romadane, 1957
Romadane, I.,
Zh. Obshch. Khim., 1957, 27, 1833. [all data]
Luther, 1955
Luther, H.,
Private Communication 1955, 1955. [all data]
Anderson, Smith, et al., 1953
Anderson, D.G.; Smith, J.C.; Rallings, R.J.,
J. Chem. Soc., 1953, 1953, 443. [all data]
Bailey, Pickering, et al., 1949
Bailey, A.S.; Pickering, G.B.; Smith, J.C.,
Alkylnaphthalenes: III the n-butyl, amyl, and hexylnaphthalenes,
J. Inst. Pet., 1949, 35, 103-17. [all data]
Koelbel, 1949
Koelbel, H.,
Alkylnaphthalenes as Lubricating-oil Models,
Brennst.-Chem., 1949, 30, 73-80. [all data]