2-heptylnaphthalene
- Formula: C17H22
- Molecular weight: 226.3566
- IUPAC Standard InChIKey: ISVPANZFACDCFN-UHFFFAOYSA-N
- CAS Registry Number: 2876-45-1
- Chemical structure:
View 3d structure (requires JavaScript / HTML 5) - Permanent link for this species. Use this link for bookmarking this species for future reference.

Phase change data

Data compiled by: Thermodynamics Research Center, NIST Boulder Laboratories, Chris Muzny director
Quantity | Value | Units | Method | Reference | Comment |
---|---|---|---|---|---|
Tboil | 594. | K | N/A | Luther, 1955 | Uncertainty assigned by TRC = 8. K |
Quantity | Value | Units | Method | Reference | Comment |
Tfus | 278.5 | K | N/A | Luther, 1955 | Uncertainty assigned by TRC = 2. K |
Tfus | 267.9 | K | N/A | Koelbel, 1949 | Uncertainty assigned by TRC = 1.5 K |

References

Luther, 1955
Luther, H.,
Private Communication 1955, 1955. [all data]
Koelbel, 1949
Koelbel, H.,
Alkylnaphthalenes as Lubricating-oil Models,
Brennst.-Chem., 1949, 30, 73-80. [all data]