2-octylnaphthalene
- Formula: C18H24
- Molecular weight: 240.3832
- IUPAC Standard InChIKey: GRHRSOQTWNKWMH-UHFFFAOYSA-N
- CAS Registry Number: 2876-44-0
- Chemical structure:
View 3d structure (requires JavaScript / HTML 5) - Permanent link for this species. Use this link for bookmarking this species for future reference.

Phase change data

Data compiled by: Thermodynamics Research Center, NIST Boulder Laboratories, Chris Muzny director
Quantity | Value | Units | Method | Reference | Comment |
---|---|---|---|---|---|
Tboil | 609. | K | N/A | Luther, 1955 | Uncertainty assigned by TRC = 6. K |
Tboil | 617.2 | K | N/A | Luther and Wachter, 1949 | Uncertainty assigned by TRC = 5. K; ~ |
Quantity | Value | Units | Method | Reference | Comment |
Tfus | 271. | K | N/A | Shakarashvili and Bekauri, 1966 | Uncertainty assigned by TRC = 3. K |
Tfus | 276.5 | K | N/A | Luther, 1955 | Uncertainty assigned by TRC = 2. K |
Tfus | 276.6 | K | N/A | Koelbel, 1949 | Uncertainty assigned by TRC = 1.5 K |
Tfus | 228. | K | N/A | Petrov and Andreev, 1942 | Uncertainty assigned by TRC = 5. K |

References

Luther, 1955
Luther, H.,
Private Communication 1955, 1955. [all data]
Luther and Wachter, 1949
Luther, H.; Wachter, G.,
Preparation and physical properties of alkyl substituted naphthalene,
Chem. Ber., 1949, 82, 161-176. [all data]
Shakarashvili and Bekauri, 1966
Shakarashvili, T.S.; Bekauri, N.G.,
Catalytic Conversion of C18 Alkylaromatic and Alkylnapthenic Hydrocarbons,
Soobshch. Akad. Nauk Gruz. SSR, 1966, 43, 1, 97. [all data]
Koelbel, 1949
Koelbel, H.,
Alkylnaphthalenes as Lubricating-oil Models,
Brennst.-Chem., 1949, 30, 73-80. [all data]
Petrov and Andreev, 1942
Petrov, A.D.; Andreev, D.N.,
Synthesis of Monoalkylnaphthalenes and Their Hydro Derivatives,
Zh. Obshch. Khim., 1942, 12, 95. [all data]