Naphthalene, 2-(1,1-dimethylethyl)-
- Formula: C14H16
- Molecular weight: 184.2768
- IUPAC Standard InChIKey: MCEORGGPAKTORV-UHFFFAOYSA-N
- CAS Registry Number: 2876-35-9
- Chemical structure:
View 3d structure (requires JavaScript / HTML 5) - Other names: Naphthalene, 2-tert-butyl-; β-tert-Butylnaphthalene; 2-tert-Butylnaphthalene; 2-(1,1-Dimethylethyl)naphthalene

Phase change data

Data compiled by: Thermodynamics Research Center, NIST Boulder Laboratories, Chris Muzny director
Quantity | Value | Units | Method | Reference | Comment |
---|---|---|---|---|---|
Tboil | 554.8 | K | N/A | Romadane, 1957 | Uncertainty assigned by TRC = 4. K |
Tboil | 558. | K | N/A | Crawford and Glesmann, 1954 | Uncertainty assigned by TRC = 15. K |
Tboil | 550. | K | N/A | Bromby, Peters, et al., 1943 | Uncertainty assigned by TRC = 5. K |
Tboil | 549. | K | N/A | Bromby, Peters, et al., 1943 | Uncertainty assigned by TRC = 6. K |
Tboil | 548. | K | N/A | Tsukervanik and Terent'eva, 1937 | Uncertainty assigned by TRC = 5. K |
Quantity | Value | Units | Method | Reference | Comment |
Tfus | 354. | K | N/A | Buu-Hoi and Cagniant, 1942 | Uncertainty assigned by TRC = 4. K |
Tfus | 267. | K | N/A | Petrov and Andreev, 1942 | Uncertainty assigned by TRC = 4. K |

References

Romadane, 1957
Romadane, I.,
Zh. Obshch. Khim., 1957, 27, 1939. [all data]
Crawford and Glesmann, 1954
Crawford, H.M.; Glesmann, M.C.,
2,6-Di-t-butylnaphthalene,
J. Am. Chem. Soc., 1954, 76, 1108. [all data]
Bromby, Peters, et al., 1943
Bromby, N.G.; Peters, A.T.; Rowe, F.M.,
J. Chem. Soc., 1943, 1943, 144-5. [all data]
Tsukervanik and Terent'eva, 1937
Tsukervanik, I.P.; Terent'eva, I.,
Condensation of Alcahols with Aromatic Hydrocarbons in the Presence of Anhydrous ALuminum CHloride. IV. Condensation of ALiphatic Alcohols with Naphthalene,
Zh. Obshch. Khim., 1937, 7, 637. [all data]
Buu-Hoi and Cagniant, 1942
Buu-Hoi, Ng.Ph.; Cagniant, P.,
Condensed Aromatic Nuclei IV. Synthesis of Six New Substituted Phenalans,
Rev. Sci., 1942, 80, 271. [all data]
Petrov and Andreev, 1942
Petrov, A.D.; Andreev, D.N.,
Synthesis of Monoalkylnaphthalenes and Their Hydro Derivatives,
Zh. Obshch. Khim., 1942, 12, 95. [all data]