Benzaldehyde, 2-(2-propenyloxy)-
- Formula: C10H10O2
- Molecular weight: 162.1852
- IUPAC Standard InChIKey: BXCJDECTRRMSCV-UHFFFAOYSA-N
- CAS Registry Number: 28752-82-1
- Chemical structure:
View 3d structure (requires JavaScript / HTML 5) - Other names: Benzaldehyde, o-(allyloxy)-; o-(Allyloxy)benzaldehyde; 2-(Allyloxy)benzaldehyde

Phase change data

Data compiled by: Robert L. Brown and Stephen E. Stein
Reduced pressure boiling point
Tboil (K) | Pressure (bar) | Reference |
---|---|---|
403. | 0.013 | Frinton Laboratories Inc., 1986 |

References

Frinton Laboratories Inc., 1986
Frinton Laboratories Inc.,
Catalog Number 11, Frinton Laboratories Inc., Vineland, NJ, 1986, 99. [all data]