Poly-2,2'-(m-phenylene)-5,5'-dibenzoxazole methane

Condensed phase thermochemistry data

Data compiled by: Eugene S. Domalski and Elizabeth D. Hearing

Quantity Value Units Method Reference Comment
solid,1 bar330.3J/mol*KN/AKaryakin, Rabinovich, et al., 1975
solid,1 bar330.3J/mol*KN/AKaryakin, Mochalov, et al., 1973

Constant pressure heat capacity of solid

Cp,solid (J/mol*K) Temperature (K) Reference Comment
324.6300.Karyakin, Mochalov, et al., 1973T = 100 to 490 K.

References

Karyakin, Rabinovich, et al., 1975
Karyakin, N.V.; Rabinovich, I.B.; Kamelova, G.P.; Mochalov, A.N.; Tseitlin, G.M.; Kulagin, V.N.; Korshak, V.V., Thermodynamics of the synthesis of poly-2,2'-(m-phenylene)-5,5'-dibenzoxazolomethane, Vysokomol. Soedin., 1975, A17, 984-988. [all data]

Karyakin, Mochalov, et al., 1973
Karyakin, N.V.; Mochalov, A.N.; Kamelova, G.P.; Kiparisova, E.G.; Tseitlin, G.M.; Kulagin, V.N.; Rabinovich, I.B.; Korshak, V.V., Thermodynamics of the synthesis of poly[2,2'-(m-phenylene)-5,5'-dibenzoxazolemethane] by intramolecular cyclodehydration of poly(4,4'-dihydroxy-3,3'-isophthalamidodiphenylmethane), Tr. Khim. Khim. Tekhnol., 1973, (1), 67-68. [all data]