Arabinose(D)
- Formula: C5H10O5
- Molecular weight: 150.1299
- IUPAC Standard InChIKey: PYMYPHUHKUWMLA-VAYJURFESA-N
- CAS Registry Number: 28697-53-2
- Chemical structure:
View 3d structure (requires JavaScript / HTML 5) - Species with the same structure:
- Stereoisomers:

Condensed phase thermochemistry data

Data compiled by: Eugene S. Domalski and Elizabeth D. Hearing
Constant pressure heat capacity of solid
Cp,solid (J/mol*K) | Temperature (K) | Reference | Comment |
---|---|---|---|
184. | 303. | Kawaizumi, Kushida, et al., 1981 | T = 300 to 315 K. |

References

Kawaizumi, Kushida, et al., 1981
Kawaizumi, F.; Kushida, S.; Miyahara, Y.,
Determination of the specific heat capacities of aqueous solutions of pentose,
Bull. Chem. Soc. Japan, 1981, 54(8), 2282-2285. [all data]