5,6-dimethyl-2-heptanone
- Formula: C9H18O
- Molecular weight: 142.2386
- IUPAC Standard InChIKey: WQCPCHUHFFYMFU-UHFFFAOYSA-N
- CAS Registry Number: 2867-76-7
- Chemical structure:
View 3d structure (requires JavaScript / HTML 5) - Permanent link for this species. Use this link for bookmarking this species for future reference.

Phase change data

Data compiled by: Thermodynamics Research Center, NIST Boulder Laboratories, Chris Muzny director
Quantity | Value | Units | Method | Reference | Comment |
---|---|---|---|---|---|
Tboil | 457. | K | N/A | Wallach, 1911 | Uncertainty assigned by TRC = 4. K |
Tboil | 458.9 | K | N/A | Wallach, 1911 | Uncertainty assigned by TRC = 3. K |

References

Wallach, 1911
Wallach, O.,
Justus Liebigs Ann. Chem., 1911, 381, 51. [all data]