Bicyclo[7.1.0]decane
- Formula: C10H18
- Molecular weight: 138.2499
- IUPAC Standard InChIKey: SAXQCCHLVOICGG-UHFFFAOYSA-N
- CAS Registry Number: 286-76-0
- Chemical structure:
View 3d structure (requires JavaScript / HTML 5) - Stereoisomers:

Normal alkane RI, non-polar column, custom temperature program

Column type | Active phase | I | Reference | Comment |
---|---|---|---|---|
Capillary | Squalane | 1090. | Chen, 2008 | Program: not specified |

References

Chen, 2008
Chen, H.-F.,
Quantitative prediction of gas chromatography retention indices with support vector machines, radial basis neutral networks and multiple linear regression,
Anal. Chim. Acta, 2008, 609, 1, 24-36, https://doi.org/10.1016/j.aca.2008.01.003
. [all data]