Tricyclo[7.1.0.0(4,6)]decane
- Formula: C10H16
- Molecular weight: 136.2340
- IUPAC Standard InChIKey: QFNRBEUEKKYIGV-UHFFFAOYSA-N
- CAS Registry Number: 286-73-7
- Chemical structure:
View 3d structure (requires JavaScript / HTML 5) - Permanent link for this species. Use this link for bookmarking this species for future reference.

Condensed phase thermochemistry data

Data compiled by: Hussein Y. Afeefy, Joel F. Liebman, and Stephen E. Stein
Quantity | Value | Units | Method | Reference | Comment |
---|---|---|---|---|---|
ΔcH°liquid | -6173.70 | kJ/mol | Ccb | Koch, 1963 | Heat of combustion was corrected for net Hc; Corresponding ΔfHºliquid = -48.03 kJ/mol (simple calculation by NIST; no Washburn corrections) |

References

Koch, 1963
Koch, S.D.,
Dispirane hydrocarbons as high energy fuels, Patent No. 3,113,421 to Monsanto Research Corp., Everett, MA, USA, 12/10/63, 1963, 1. [all data]