DL-Alanine, N-DL-alanyl-
- Formula: C6H12N2O3
- Molecular weight: 160.1711
- IUPAC Standard InChIKey: DEFJQIDDEAULHB-UHFFFAOYSA-N
- CAS Registry Number: 2867-20-1
- Chemical structure:
View 3d structure (requires JavaScript / HTML 5) - Stereoisomers:
- Other names: Alanine, N-DL-alanyl-, DL-; DL-Ala-DL-Ala; DL-Alanyl-DL-alanine; N-DL-Alanyl-DL-alanine

Condensed phase thermochemistry data

Data compiled as indicated in comments:
ALS - Hussein Y. Afeefy, Joel F. Liebman, and Stephen E. Stein
DH - Eugene S. Domalski and Elizabeth D. Hearing
Quantity | Value | Units | Method | Reference | Comment |
---|---|---|---|---|---|
ΔfH°solid | -807.3 ± 1.9 | kJ/mol | Ccb | Diaz, Domalski, et al., 1992 | ALS |
Quantity | Value | Units | Method | Reference | Comment |
ΔcH°solid | -3267.5 ± 1.8 | kJ/mol | Ccb | Diaz, Domalski, et al., 1992 | ALS |
Constant pressure heat capacity of solid
Cp,solid (J/mol*K) | Temperature (K) | Reference | Comment |
---|---|---|---|
189.0 | 298. | Kulikov, Kozlov, et al., 1989 | T = 298 to 348 K.; DH |

Phase change data

Data compiled by: William E. Acree, Jr., James S. Chickos
Enthalpy of fusion
ΔfusH (kJ/mol) | Temperature (K) | Reference |
---|---|---|
33.2 | 483.2 | Domalski and Hearing, 1996 |

Reaction thermochemistry data

Data compiled as indicated in comments:
B - John E. Bartmess
RCD - Robert C. Dunbar
Individual Reactions
CAS Reg. No. 581782-45-8 + = C12H23N4O6-
By formula: CAS Reg. No. 581782-45-8 + C6H12N2O3 = C12H23N4O6-
Quantity | Value | Units | Method | Reference | Comment |
---|---|---|---|---|---|
ΔrH° | 35.1 ± 1.7 | kJ/mol | TDEq | Liu, Wyttenbacj, et al., 2004 | gas phase; B |
Quantity | Value | Units | Method | Reference | Comment |
ΔrG° | 11.3 | kJ/mol | TDEq | Liu, Wyttenbacj, et al., 2004 | gas phase; B |
By formula: Na+ + C6H12N2O3 = (Na+ • C6H12N2O3)
Quantity | Value | Units | Method | Reference | Comment |
---|---|---|---|---|---|
ΔrH° | 180. ± 7.1 | kJ/mol | CIDC | Cerda, Hoyau, et al., 1998 | RCD |

Ion clustering data

Data compiled by: Robert C. Dunbar
Clustering reactions
By formula: Na+ + C6H12N2O3 = (Na+ • C6H12N2O3)
Quantity | Value | Units | Method | Reference | Comment |
---|---|---|---|---|---|
ΔrH° | 180. ± 7.1 | kJ/mol | CIDC | Cerda, Hoyau, et al., 1998 |

References

Diaz, Domalski, et al., 1992
Diaz, E.L.; Domalski, E.S.; Colbert, J.C.,
Enthalpies of combustion of glycylglycine and DL-alanyl-DL-alamine,
J. Chem. Thermodyn., 1992, 24, 1311-1318. [all data]
Kulikov, Kozlov, et al., 1989
Kulikov, O.V.; Kozlov, V.A.; Malenkina, L.I.; Badelin, V.G.,
Heat capacities of amino acids and peptides and excess characteristics ot their aqueous solutions, Sbornik Nauch. Trud., Termodin. Rast. neelect., Ivanovo,
Inst. nevod. rast., 1989, Akad. [all data]
Domalski and Hearing, 1996
Domalski, Eugene S.; Hearing, Elizabeth D.,
Heat Capacities and Entropies of Organic Compounds in the Condensed Phase. Volume III,
J. Phys. Chem. Ref. Data, 1996, 25, 1, 1, https://doi.org/10.1063/1.555985
. [all data]
Liu, Wyttenbacj, et al., 2004
Liu, D.; Wyttenbacj, T.; Carpenter, C.J.; Bowers, M.T.,
Investigation of Non-Covalent Interactions in Deprotonated Peptides: Structural and Energetic Competition between Aggregation and Hydration,
J. Am. Chem. Soc., 2004, 126, 10, 3261, https://doi.org/10.1021/ja0393628
. [all data]
Cerda, Hoyau, et al., 1998
Cerda, B.A.; Hoyau, S.; Ohanessian, G.; Wesdemiotis, C.,
PAs of Peptides,
J. Am. Chem. Soc., 1998, 120, 2437. [all data]