Bicyclo[5.1.0]octane
- Formula: C8H14
- Molecular weight: 110.1968
- IUPAC Standard InChIKey: AKHMHYGTZRJYBS-UHFFFAOYSA-N
- CAS Registry Number: 286-43-1
- Chemical structure:
View 3d structure (requires JavaScript / HTML 5) - Stereoisomers:

Gas phase thermochemistry data

Data compiled by: Hussein Y. Afeefy, Joel F. Liebman, and Stephen E. Stein
Quantity | Value | Units | Method | Reference | Comment |
---|---|---|---|---|---|
ΔfH°gas | -17. ± 3. | kJ/mol | Ccb | Chang, McNally, et al., 1970 |

Condensed phase thermochemistry data

Data compiled by: Hussein Y. Afeefy, Joel F. Liebman, and Stephen E. Stein
Quantity | Value | Units | Method | Reference | Comment |
---|---|---|---|---|---|
ΔfH°liquid | -60. ± 2. | kJ/mol | Ccb | Chang, McNally, et al., 1970 | |
Quantity | Value | Units | Method | Reference | Comment |
ΔcH°liquid | -5089. ± 1. | kJ/mol | Ccb | Chang, McNally, et al., 1970 | Corresponding ΔfHºliquid = -60.2 kJ/mol (simple calculation by NIST; no Washburn corrections) |

Phase change data

Data compiled as indicated in comments:
TRC - Thermodynamics Research Center, NIST Boulder Laboratories, Chris Muzny director
AC - William E. Acree, Jr., James S. Chickos
ALS - Hussein Y. Afeefy, Joel F. Liebman, and Stephen E. Stein
DRB - Donald R. Burgess, Jr.
Quantity | Value | Units | Method | Reference | Comment |
---|---|---|---|---|---|
Tboil | 414. | K | N/A | Cope and Youngquist, 1962 | Uncertainty assigned by TRC = 3. K; TRC |
Quantity | Value | Units | Method | Reference | Comment |
ΔvapH° | 43.5 ± 0.8 | kJ/mol | N/A | Osmont, Catoire, et al., 2008 | AC |
ΔvapH° | 43.5 ± 0.8 | kJ/mol | V | Chang, McNally, et al., 1970 | ALS |
ΔvapH° | 43.0 | kJ/mol | N/A | Chang, McNally, et al., 1970 | DRB |

Kovats' RI, non-polar column, isothermal

Column type | Active phase | Temperature (C) | I | Reference | Comment |
---|---|---|---|---|---|
Capillary | Squalane | 70. | 885. | Schomburg, 1966 | |
Capillary | Squalane | 70. | 885. | Schomburg, 1966 |

Kovats' RI, polar column, temperature ramp

Column type | Active phase | I | Reference | Comment |
---|---|---|---|---|
Capillary | DB-Wax | 1035. | Umano and Shibamoto, 1987 | He, 40. C @ 10. min, 2. K/min; Column length: 60. m; Column diameter: 0.25 mm; Tend: 200. C |

Normal alkane RI, non-polar column, custom temperature program

Column type | Active phase | I | Reference | Comment |
---|---|---|---|---|
Capillary | Squalane | 888. | Chen, 2008 | Program: not specified |

Normal alkane RI, polar column, temperature ramp

Column type | Active phase | I | Reference | Comment |
---|---|---|---|---|
Capillary | DB-Wax | 1045. | Chung, Eiserich, et al., 1993 | 60. C @ 4. min, 3. K/min; Column length: 60. m; Column diameter: 0.25 mm; Tend: 220. C |

References

Chang, McNally, et al., 1970
Chang, Sho-ju.; McNally, D.; Shary-Tehrany, S.; Hickey, S.M.J.; Boyd, R.H.,
The heats of combustion and strain energies of bicylo[n.m.O]alkanes,
J. Am. Chem. Soc., 1970, 92, 3109-3118. [all data]
Cope and Youngquist, 1962
Cope, A.C.; Youngquist, M.J.,
Proximity Effects XDXV. Pyrolysis of Cyclooctyl and Cyclodecyl Esters,
J. Am. Chem. Soc., 1962, 84, 2411. [all data]
Osmont, Catoire, et al., 2008
Osmont, Antoine; Catoire, Laurent; Gokalp, Iskender,
Physicochemical Properties and Thermochemistry of Propellanes,
Energy Fuels, 2008, 22, 4, 2241-2257, https://doi.org/10.1021/ef8000423
. [all data]
Schomburg, 1966
Schomburg, G.,
Gaschromatographische Retentionsdaten und struktur chemischer verbindungen. III. Alkylverzweigte und ungesättigte cyclische Kohlenwasserstoffe,
J. Chromatogr., 1966, 23, 18-41, https://doi.org/10.1016/S0021-9673(01)98653-4
. [all data]
Umano and Shibamoto, 1987
Umano, K.; Shibamoto, T.,
Analysis of headspace volatiles from overheated beef fat,
J. Agric. Food Chem., 1987, 35, 1, 14-18, https://doi.org/10.1021/jf00073a004
. [all data]
Chen, 2008
Chen, H.-F.,
Quantitative prediction of gas chromatography retention indices with support vector machines, radial basis neutral networks and multiple linear regression,
Anal. Chim. Acta, 2008, 609, 1, 24-36, https://doi.org/10.1016/j.aca.2008.01.003
. [all data]
Chung, Eiserich, et al., 1993
Chung, T.Y.; Eiserich, J.P.; Shibamoto, T.,
Volatile compounds identified in headspace samples of peanut oil heated under temperatures ranging from 50 to 200 °C,
J. Agric. Food Chem., 1993, 41, 9, 1467-1470, https://doi.org/10.1021/jf00033a022
. [all data]