7-Thiabicyclo[4.1.0]heptane
- Formula: C6H10S
- Molecular weight: 114.209
- IUPAC Standard InChIKey: PQWJNIJNYRPOAA-UHFFFAOYSA-N
- CAS Registry Number: 286-28-2
- Chemical structure:
View 3d structure (requires JavaScript / HTML 5) - Other names: Cyclohexane, 1,2-epithio-; Cyclohexene episulfide; Cyclohexene sulfide; 1,2-Cyclohexylene sulfide; 1,2-epithiocyclohexane

Phase change data

Data compiled by: Robert L. Brown and Stephen E. Stein
Reduced pressure boiling point
Tboil (K) | Pressure (bar) | Reference |
---|---|---|
329.7 | 0.016 | Weast and Grasselli, 1989 |

Van Den Dool and Kratz RI, polar column, temperature ramp

Column type | Active phase | I | Reference | Comment |
---|---|---|---|---|
Capillary | Supelcowax-10 | 1390. | Chung, 1999 | 60. m/0.25 mm/0.25 μm, He, 35. C @ 5. min, 2. K/min, 195. C @ 90. min |

References

Weast and Grasselli, 1989
CRC Handbook of Data on Organic Compounds, 2nd Editon, Weast,R.C and Grasselli, J.G., ed(s)., CRC Press, Inc., Boca Raton, FL, 1989, 1. [all data]
Chung, 1999
Chung, H.Y.,
Volatile components in crabmeats of Charybdis feriatus,
J. Agric. Food Chem., 1999, 47, 6, 2280-2287, https://doi.org/10.1021/jf981027t
. [all data]