Benzene, 4-bromo-1,2-dimethoxy-
- Formula: C8H9BrO2
- Molecular weight: 217.060
- IUPAC Standard InChIKey: KBTMGSMZIKLAHN-UHFFFAOYSA-N
- CAS Registry Number: 2859-78-1
- Chemical structure:
View 3d structure (requires JavaScript / HTML 5) - Other names: 1-Bromo-3,4-dimethoxybenzene; 4-Bromo-1,2-dimethoxybenzene; 4-Bromoveratrole; 3,4-Dimethoxybromobenzene; 3,4-Dimethoxyphenyl bromide; p-Bromoveratrole; 4-Bromoguaiacol, methyl ether; Bromoveratrole

Phase change data

Data compiled by: Robert L. Brown and Stephen E. Stein
Quantity | Value | Units | Method | Reference | Comment |
---|---|---|---|---|---|
Tboil | 528.7 | K | N/A | Aldrich Chemical Company Inc., 1990 |

Van Den Dool and Kratz RI, non-polar column, custom temperature program

Column type | Active phase | I | Reference | Comment |
---|---|---|---|---|
Capillary | VF-5MS | 1423.7 | Tret'yakov, 2008 | 30. m/0.25 mm/0.25 μm, He; Program: Multi-step temperature program; T(initial)=60C; T(final)=270C |

References

Aldrich Chemical Company Inc., 1990
Aldrich Chemical Company Inc.,
Catalog Handbook of Fine Chemicals, Aldrich Chemical Company, Inc., Milwaukee WI, 1990, 1. [all data]
Tret'yakov, 2008
Tret'yakov, K.V.,
Retention Data. NIST Mass Spectrometry Data Center., NIST Mass Spectrometry Data Center, 2008. [all data]