Cyclohexane, 1,2,4-triethenyl-
- Formula: C12H18
- Molecular weight: 162.2713
- IUPAC Standard InChIKey: KTRQRAQRHBLCSQ-UHFFFAOYSA-N
- CAS Registry Number: 2855-27-8
- Chemical structure:
View 3d structure (requires JavaScript / HTML 5) - Stereoisomers:
- Other names: Cyclohexane, 1,2,4-trivinyl-; 1,2,4-Trivinylcyclohexane; Cyclohexane, 1,2,4-tris-ethenyl; cyclohexane-1,2,4-triyltris(ethylene)

Phase change data

Data compiled by: Robert L. Brown and Stephen E. Stein
Reduced pressure boiling point
Tboil (K) | Pressure (bar) | Reference |
---|---|---|
359.7 | 0.027 | Weast and Grasselli, 1989 |

Normal alkane RI, non-polar column, custom temperature program

Column type | Active phase | I | Reference | Comment |
---|---|---|---|---|
Capillary | Squalane | 1114. | Chen, 2008 | Program: not specified |

References

Weast and Grasselli, 1989
CRC Handbook of Data on Organic Compounds, 2nd Editon, Weast,R.C and Grasselli, J.G., ed(s)., CRC Press, Inc., Boca Raton, FL, 1989, 1. [all data]
Chen, 2008
Chen, H.-F.,
Quantitative prediction of gas chromatography retention indices with support vector machines, radial basis neutral networks and multiple linear regression,
Anal. Chim. Acta, 2008, 609, 1, 24-36, https://doi.org/10.1016/j.aca.2008.01.003
. [all data]