Sevoflurane
- Formula: C4H3F7O
- Molecular weight: 200.0548
- IUPAC Standard InChIKey: DFEYYRMXOJXZRJ-UHFFFAOYSA-N
- CAS Registry Number: 28523-86-6
- Chemical structure:
View 3d structure (requires JavaScript / HTML 5) - Other names: 1,1,1,3,3,3-Hexafluoro-2-fluoromethoxypropane

Normal alkane RI, non-polar column, custom temperature program

Column type | Active phase | I | Reference | Comment |
---|---|---|---|---|
Capillary | SPB-1 | 409. | Flanagan, Streete, et al., 1997 | 60. m/0.53 mm/5. μm, He; Program: 40C(6min) => 5C/min => 80C => 10C/min => 200C |

References

Flanagan, Streete, et al., 1997
Flanagan, R.J.; Streete, P.J.; Ramsey, J.D.,
Volatile Substance Abuse, UNODC Technical Series, No 5, United Nations, Office on Drugs and Crime, Vienna International Centre, PO Box 500, A-1400 Vienna, Austria, 1997, 56, retrieved from http://www.odccp.org/pdf/technicalseries1997-01-011.pdf. [all data]