8-Propyltheophylline
- Formula: C10H14N4O2
- Molecular weight: 222.2438
- IUPAC Standard InChIKey: LMQXNURVVYWBSR-UHFFFAOYSA-N
- CAS Registry Number: 2850-41-1
- Chemical structure:
View 3d structure (requires JavaScript / HTML 5) - Permanent link for this species. Use this link for bookmarking this species for future reference.

Phase change data

Data compiled as indicated in comments:
TRC - Thermodynamics Research Center, NIST Boulder Laboratories, Chris Muzny director
AC - William E. Acree, Jr., James S. Chickos
Quantity | Value | Units | Method | Reference | Comment |
---|---|---|---|---|---|
Tfus | 534.3 | K | N/A | Gondova, Kralik, et al., 1989 | Uncertainty assigned by TRC = 0.6 K; TRC |
Tfus | 554.7 | K | N/A | Salas-Peregrin, Colacio-Rodriguez, et al., 1984 | Uncertainty assigned by TRC = 0.2 K; TRC |
Enthalpy of fusion
ΔfusH (kcal/mol) | Temperature (K) | Method | Reference | Comment |
---|---|---|---|---|
7.96 | 534.3 | DSC | Acree, 1991 | See also Gondová, Králik, et al., 1989.; AC |

References

Gondova, Kralik, et al., 1989
Gondova, T.; Kralik, P.; Gonda, J.,
Determination of some thermodynamic characteristics of melting of 8-alkyltheophyllines by the DSC method,
Thermochim. Acta, 1989, 156, 1, 147, https://doi.org/10.1016/0040-6031(89)87180-1
. [all data]
Salas-Peregrin, Colacio-Rodriguez, et al., 1984
Salas-Peregrin, J.M.; Colacio-Rodriguez, E.; Girela-Vilchez, F.; Roldan-Medina, M.,
thermal studies on purine complexes. VII. 8-theophylline derivatives and their silver(I) complexes,
Thermochim. Acta, 1984, 80, 323. [all data]
Acree, 1991
Acree, William E.,
Thermodynamic properties of organic compounds: enthalpy of fusion and melting point temperature compilation,
Thermochimica Acta, 1991, 189, 1, 37-56, https://doi.org/10.1016/0040-6031(91)87098-H
. [all data]
Gondová, Králik, et al., 1989
Gondová, T.; Králik, P.; Gonda, J.,
Determination of some thermodynamic characteristics of melting of 8-alkyltheophyllines by the DSC method,
Thermochimica Acta, 1989, 156, 1, 147-155, https://doi.org/10.1016/0040-6031(89)87180-1
. [all data]