2,5-Dihydrothiophene 1,1-dioxide
- Formula: C4H6O2S
- Molecular weight: 118.154
- IUPAC Standard InChIKey: MBDNRNMVTZADMQ-UHFFFAOYSA-N
- CAS Registry Number: 28452-93-9
- Chemical structure:
View 3d structure (requires JavaScript / HTML 5) - Species with the same structure:

Gas phase thermochemistry data

Data compiled by: Hussein Y. Afeefy, Joel F. Liebman, and Stephen E. Stein
Quantity | Value | Units | Method | Reference | Comment |
---|---|---|---|---|---|
ΔfH°gas | -256.2 ± 2.8 | kJ/mol | Ccr | Mackle and O'Hare, 1961 | Reanalyzed by Cox and Pilcher, 1970, Original value = -256. ± 3. kJ/mol; Hfusion=2.5±0.5 kcal/mol |

Condensed phase thermochemistry data

Data compiled by: Hussein Y. Afeefy, Joel F. Liebman, and Stephen E. Stein
Quantity | Value | Units | Method | Reference | Comment |
---|---|---|---|---|---|
ΔfH°solid | -318.9 ± 1.3 | kJ/mol | Ccr | Mackle and O'Hare, 1961 | Reanalyzed by Cox and Pilcher, 1970, Original value = -318. ± 1.4 kJ/mol; Hfusion=2.5±0.5 kcal/mol |
Quantity | Value | Units | Method | Reference | Comment |
ΔcH°solid | -2714.9 ± 1.3 | kJ/mol | Ccr | Mackle and O'Hare, 1961 | Reanalyzed by Cox and Pilcher, 1970, Original value = -2710. ± 1. kJ/mol; Hfusion=2.5±0.5 kcal/mol |

References

Mackle and O'Hare, 1961
Mackle, H.; O'Hare, P.A.G.,
Studies in the thermochemistry of sulphones. Part 7.-Thermochemistry of monomeric and polymeric butadiene sulphones,
Trans. Faraday Soc., 1961, 57, 1873-1876. [all data]
Cox and Pilcher, 1970
Cox, J.D.; Pilcher, G.,
Thermochemistry of Organic and Organometallic Compounds, Academic Press, New York, 1970, 1-636. [all data]