Ethanol, 2-(cyclohexylamino)-
- Formula: C8H17NO
- Molecular weight: 143.2267
- IUPAC Standard InChIKey: MGUMZJAQENFQKN-UHFFFAOYSA-N
- CAS Registry Number: 2842-38-8
- Chemical structure:
View 3d structure (requires JavaScript / HTML 5) - Other names: N-Cyclohexylaminoethanol; 2-(Cyclohexylamino)ethanol; N-Cyclohexylethanolamine; N-(2-Hydroxyethyl)cyclohexylamine; N-(2-Hydroxyethyl)-N-cyclohexylamine; Abbomeen e-25 aerosol; Abromeen e-25; Cyclohexlaminoethanol; Cyclohexylamine, hydroxyethyl-; Ethanol, 2-(cyclohexylamino)-, (aerosol); N-Cyclohexyl-2-hydroxyethylamine; NSC 1505

Phase change data

Data compiled by: Robert L. Brown and Stephen E. Stein
Reduced pressure boiling point
Tboil (K) | Pressure (bar) | Reference |
---|---|---|
397. to 398. | 0.020 | Frinton Laboratories Inc., 1986 |

References

Frinton Laboratories Inc., 1986
Frinton Laboratories Inc.,
Catalog Number 11, Frinton Laboratories Inc., Vineland, NJ, 1986, 99. [all data]