tetra-μ3-carbonyldodecacarbonyl-octahedro-hexarhodium
- Formula: C16O16Rh6
- Molecular weight: 1065.5946
- CAS Registry Number: 28407-51-4

Condensed phase thermochemistry data

Data compiled by: José A. Martinho Simões
Quantity | Value | Units | Method | Reference | Comment |
---|---|---|---|---|---|
ΔfH°solid | -2418. ± 17. | kJ/mol | Review | Martinho Simões |

Phase change data

Data compiled as indicated in comments:
AC - William E. Acree, Jr., James S. Chickos
MS - José A. Martinho Simões
Quantity | Value | Units | Method | Reference | Comment |
---|---|---|---|---|---|
ΔsubH° | 117. ± 20. | kJ/mol | N/A | Pilcher and Skinner, 1983 | See also Brown, Connor, et al., 1975.; AC |
ΔsubH° | 117. ± 20. | kJ/mol | TD-HFC | Connor, Skinner, et al., 1973 | MS |

Gas phase thermochemistry data

Data compiled by: José A. Martinho Simões
Quantity | Value | Units | Method | Reference | Comment |
---|---|---|---|---|---|
ΔfH°gas | -2301. ± 26. | kJ/mol | Review | Martinho Simões |

Reaction thermochemistry data

Data compiled by: José A. Martinho Simões

Individual Reactions

C16O16Rh6 (cr) = 16Carbon monoxide (g) + 6rhodium (cr)

By formula: C16O16Rh6 (cr) = 16CO (g) + 6Rh (cr)

Quantity Value Units Method Reference Comment
Δr649. ± 17.kJ/molTD-HFCBrown, Connor, et al., 1975Please also see Pedley and Rylance, 1977.

References

Martinho Simões
Martinho Simões, J.A.,
Private communication (see http://webbook.nist.gov/chemistry/om/). [all data]
Pilcher and Skinner, 1983
Pilcher, G.; Skinner, H.A.,
Thermochemistry of organometallic compounds, 1983, 43-90, https://doi.org/10.1002/9780470771686.ch2
. [all data]
Brown, Connor, et al., 1975
Brown, D. Lalage S.; Connor, Joseph A.; Skinner, Henry A.,
Microcalorimetric studies. The enthalpy of formation of hexadecacarbonylhexarhodium, Rh6(CO)16,
J. Chem. Soc., Faraday Trans. 1, 1975, 71, 0, 699, https://doi.org/10.1039/f19757100699
. [all data]
Connor, Skinner, et al., 1973
Connor, J.A.; Skinner, H.A.; Virmani, Y.,
High temperature microcalorimetric studies of the thermal decomposition and iodination of polynuclear carbonyls of Fe, Co, Ru, Rh, Re, Os and Ir,
Faraday Symp. Chem. Soc., 1973, 8, 18, https://doi.org/10.1039/fs9730800018
. [all data]