Tricyclo[8.2.2.24,7]-hexadecane
- Formula: C16H28
- Molecular weight: 220.3935
- IUPAC Standard InChIKey: NJKSNKVRWTTWPA-UHFFFAOYSA-N
- CAS Registry Number: 283-68-1
- Chemical structure:
View 3d structure (requires JavaScript / HTML 5) - Permanent link for this species. Use this link for bookmarking this species for future reference.

Gas phase thermochemistry data

Data compiled by: Hussein Y. Afeefy, Joel F. Liebman, and Stephen E. Stein
Quantity | Value | Units | Method | Reference | Comment |
---|---|---|---|---|---|
ΔfH°gas | -152. ± 13. | kJ/mol | Ccb | Shieh, McNally, et al., 1969 | Reanalyzed by Pedley, Naylor, et al., 1986, Original value = -153. ± 15. kJ/mol |

Condensed phase thermochemistry data

Data compiled by: Hussein Y. Afeefy, Joel F. Liebman, and Stephen E. Stein
Quantity | Value | Units | Method | Reference | Comment |
---|---|---|---|---|---|
ΔfH°solid | -244. ± 13. | kJ/mol | Ccb | Shieh, McNally, et al., 1969 | |
Quantity | Value | Units | Method | Reference | Comment |
ΔcH°solid | -10054. ± 13. | kJ/mol | Ccb | Shieh, McNally, et al., 1969 | Corresponding ΔfHºsolid = -244. kJ/mol (simple calculation by NIST; no Washburn corrections) |

Phase change data

Data compiled as indicated in comments:
ALS - Hussein Y. Afeefy, Joel F. Liebman, and Stephen E. Stein
DRB - Donald R. Burgess, Jr.
AC - William E. Acree, Jr., James S. Chickos
Quantity | Value | Units | Method | Reference | Comment |
---|---|---|---|---|---|
ΔsubH° | 92. ± 2. | kJ/mol | V | Shieh, McNally, et al., 1969 | ALS |
ΔsubH° | 92.0 | kJ/mol | N/A | Shieh, McNally, et al., 1969 | DRB |
Enthalpy of sublimation
ΔsubH (kJ/mol) | Temperature (K) | Method | Reference | Comment |
---|---|---|---|---|
85.2 | 327. | N/A | Stephenson and Malanowski, 1987 | Based on data from 316. to 338. K.; AC |
91.6 ± 0.9 | 327. | ME | Shieh, McNally, et al., 1969 | Based on data from 316. to 338. K. See also Pedley and Rylance, 1977.; AC |

Gas phase ion energetics data

Data compiled as indicated in comments:
LBLHLM - Sharon G. Lias, John E. Bartmess, Joel F. Liebman, John L. Holmes, Rhoda D. Levin, and W. Gary Mallard

Ionization energy determinations

IE (eV) Method Reference Comment
9.1PEGleiter, Spanget-Larsen, et al., 1984LBLHLM
9.4PEGleiter, Spanget-Larsen, et al., 1984Vertical value; LBLHLM

References

Shieh, McNally, et al., 1969
Shieh, C.; McNally, D.; Boyd, R.H.,
The heats of combustion and strain energies of some cyclophanes,
Tetrahedron, 1969, 3653-3665. [all data]
Pedley, Naylor, et al., 1986
Pedley, J.B.; Naylor, R.D.; Kirby, S.P.,
Thermochemical Data of Organic Compounds, Chapman and Hall, New York, 1986, 1-792. [all data]
Stephenson and Malanowski, 1987
Stephenson, Richard M.; Malanowski, Stanislaw,
Handbook of the Thermodynamics of Organic Compounds, 1987, https://doi.org/10.1007/978-94-009-3173-2
. [all data]
Pedley and Rylance, 1977
Pedley, J.B.; Rylance, J.,
, Computer Analysed Thermochemical Data: Organic and Organometallic Compounds, University of Sussex, Brighton, 1977. [all data]