2,10,11-Trioxa-6-azonia-1-boratatricyclo(4.4.3.0(1,6))tridecane
- Formula: C8H16BNO3
- Molecular weight: 185.029
- IUPAC Standard InChIKey: DVGDIZINSCCOLT-UHFFFAOYSA-N
- CAS Registry Number: 283-64-7
- Chemical structure:

Phase change data

Data compiled by: William E. Acree, Jr., James S. Chickos
Enthalpy of sublimation
ΔsubH (kJ/mol) | Temperature (K) | Method | Reference |
---|---|---|---|
102.2 ± 1.0 | 390. | C | Vorob'eva, Miroshnichenko, et al., 1984 |

References

Vorob'eva, Miroshnichenko, et al., 1984
Vorob'eva, V.P.; Miroshnichenko, E.A.; Solomennikova, I.I.; Zelchan, G.I.; Lukevits; Lebedev, Yu.A.,
Thermochemical investigation of trioxaazaboratricycloalkanes,
Russ Chem Bull, 1984, 33, 7, 1372-1376, https://doi.org/10.1007/BF00956509
. [all data]