dl-2-Aminobutyric acid
- Formula: C4H9NO2
- Molecular weight: 103.1198
- IUPAC Standard InChIKey: QWCKQJZIFLGMSD-UHFFFAOYSA-N
- CAS Registry Number: 2835-81-6
- Chemical structure:
View 3d structure (requires JavaScript / HTML 5) - Species with the same structure:
- Stereoisomers:
- Other names: dl-2-Amino-n-butyric acid; 2-Aminobutyric acid; dl-α-Amino-n-butyric acid; Butanoic acid, 2-amino-, (.+/-.)-; Aminobutyric acid,-2-; Butyric acid, 2-amino-, DL-; DL-2-Aminobutanoic acid; 2-Aminobutyric acid, dl; Butanoic acid, 2-amino-; Butyrine; NSC 3251; α-Aminobutyric acid; Butyric acid, dl-2-amino-, beta-form; (±)-2-aminobutyric acid

Condensed phase thermochemistry data

Data compiled by: Hussein Y. Afeefy, Joel F. Liebman, and Stephen E. Stein
Quantity | Value | Units | Method | Reference | Comment |
---|---|---|---|---|---|
ΔfH°solid | -605.8 ± 1.1 | kJ/mol | Ccb | Contineanu and Marchidan, 1994 | |
Quantity | Value | Units | Method | Reference | Comment |
ΔcH°solid | -2254. ± 1.1 | kJ/mol | Ccb | Contineanu and Marchidan, 1994 |

Phase change data

Data compiled by: William E. Acree, Jr., James S. Chickos
Enthalpy of sublimation
ΔsubH (kJ/mol) | Temperature (K) | Method | Reference | Comment |
---|---|---|---|---|
132. | 409. | A | Stephenson and Malanowski, 1987 | Based on data from 400. to 418. K. |
132. ± 2. | 409. | TE,ME | de Kruif, Voogd, et al., 1979 |

References

Contineanu and Marchidan, 1994
Contineanu, J.; Marchidan, D.I.,
The enthalpies of combustion and formation of some isomers of aminobutyric (aminobutanoic) acid,
Rev. Roum. Chim., 1994, 39, 1391-1395. [all data]
Stephenson and Malanowski, 1987
Stephenson, Richard M.; Malanowski, Stanislaw,
Handbook of the Thermodynamics of Organic Compounds, 1987, https://doi.org/10.1007/978-94-009-3173-2
. [all data]
de Kruif, Voogd, et al., 1979
de Kruif, C.G.; Voogd, J.; Offringa, J.C.A.,
Enthalpies of sublimation and vapour pressures of 14 amino acids and peptides,
The Journal of Chemical Thermodynamics, 1979, 11, 7, 651-656, https://doi.org/10.1016/0021-9614(79)90030-2
. [all data]