(-)-2,3-dimethyl-2-pentanol
- Formula: C7H16O
- Molecular weight: 116.2013
- IUPAC Standard InChIKey: YRSIFCHKXFKNME-UHFFFAOYSA-N
- CAS Registry Number: 28357-68-8
- Chemical structure:
View 3d structure (requires JavaScript / HTML 5) - Species with the same structure:

Phase change data

Data compiled by: Thermodynamics Research Center, NIST Boulder Laboratories, Chris Muzny director
Quantity | Value | Units | Method | Reference | Comment |
---|---|---|---|---|---|
Tboil | 411.15 | K | N/A | Lukes and Langthaler, 1957 | Uncertainty assigned by TRC = 3. K |

References

Lukes and Langthaler, 1957
Lukes, R.; Langthaler, J.,
Degradation of Branched Optically Active Tertiary Bases,
Chem. Listy, 1957, 51, 1869. [all data]