Benzamide, 4-amino-
- Formula: C7H8N2O
- Molecular weight: 136.1512
- IUPAC Standard InChIKey: QIKYZXDTTPVVAC-UHFFFAOYSA-N
- CAS Registry Number: 2835-68-9
- Chemical structure:
View 3d structure (requires JavaScript / HTML 5) - Other names: Benzamide, p-amino-; p-Aminobenzamide; p-Aminobenzoic acid amide; p-Carbamoylaniline; 4-Aminobenzamide

Gas phase ion energetics data

Data evaluated by: Edward P. Hunter and Sharon G. Lias
Quantity | Value | Units | Method | Reference | Comment |
---|---|---|---|---|---|
Proton affinity (review) | 927.9 | kJ/mol | N/A | Hunter and Lias, 1998 | |
Quantity | Value | Units | Method | Reference | Comment |
Gas basicity | 896.9 | kJ/mol | N/A | Hunter and Lias, 1998 |

Condensed phase thermochemistry data

Data compiled by: Hussein Y. Afeefy, Joel F. Liebman, and Stephen E. Stein
Quantity | Value | Units | Method | Reference | Comment |
---|---|---|---|---|---|
ΔfH°solid | -44.6 | kcal/mol | Ccb | Pushkareva and Kokoshko, 1946 | Author's hf298-condensed=-48.0 kcal/mol |
Quantity | Value | Units | Method | Reference | Comment |
ΔcH°solid | -887.00 | kcal/mol | Ccb | Pushkareva and Kokoshko, 1946 | Author's hf298-condensed=-48.0 kcal/mol |

References

Hunter and Lias, 1998
Hunter, E.P.; Lias, S.G.,
Evaluated Gas Phase Basicities and Proton Affinities of Molecules: An Update,
J. Phys. Chem. Ref. Data, 1998, 27, 3, 413-656, https://doi.org/10.1063/1.556018
. [all data]