2-Phenylglycine
- Formula: C8H9NO2
- Molecular weight: 151.1626
- IUPAC Standard InChIKey: ZGUNAGUHMKGQNY-UHFFFAOYSA-N
- CAS Registry Number: 2835-06-5
- Chemical structure:
View 3d structure (requires JavaScript / HTML 5) - Species with the same structure:
- Stereoisomers:
- Other names: Benzeneacetic acid, α-amino-, (.+/-.)-; (.+/-.)-α-Phenylglycine; DL-α-Aminophenylacetic acid; DL-α-Phenylglycine; DL-Phenylglycine; DL-2-Phenylglycine; Glycine, 2-phenyl-, DL-; 2-Amino-2-phenylacetic acid; Benzeneacetic acid, alpha-amino-; NSC 24619; NSC 32070; α-Aminobenzeneacetic ac; α-Aminophenylacetic acid; α-Phenylgycine

Condensed phase thermochemistry data

Data compiled by: Hussein Y. Afeefy, Joel F. Liebman, and Stephen E. Stein
Quantity | Value | Units | Method | Reference | Comment |
---|---|---|---|---|---|
ΔcH°solid | -4009. | kJ/mol | Ccb | Fischer and Wrede, 1904 | Heat of combustion corrected for pressure |

References

Fischer and Wrede, 1904
Fischer, E.; Wrede, F.,
Uber die Verbrennungswarme einiger organischer Verbindungen,
Sitzungsber. Dtsch. Akad. Wiss. Berlin Kl. Math. Phys. Tech., 1904, 687-715. [all data]