Chlorodifluoroacetic anhydride
- Formula: C4Cl2F4O3
- Molecular weight: 242.941
- IUPAC Standard InChIKey: VBJIFLOSOQGDRZ-UHFFFAOYSA-N
- CAS Registry Number: 2834-23-3
- Chemical structure:
View 3d structure (requires JavaScript / HTML 5) - Other names: Acetic acid, chlorodifluoro-, anhydride

Phase change data

Data compiled by: Robert L. Brown and Stephen E. Stein
Quantity | Value | Units | Method | Reference | Comment |
---|---|---|---|---|---|
Tboil | 369.7 | K | N/A | Aldrich Chemical Company Inc., 1990 | |
Tboil | 365.7 | K | N/A | Weast and Grasselli, 1989 |

Normal alkane RI, non-polar column, custom temperature program

Column type | Active phase | I | Reference | Comment |
---|---|---|---|---|
Capillary | Polydimethyl siloxanes | 679. | Zenkevich, 2001 | Program: not specified |

References

Aldrich Chemical Company Inc., 1990
Aldrich Chemical Company Inc.,
Catalog Handbook of Fine Chemicals, Aldrich Chemical Company, Inc., Milwaukee WI, 1990, 1. [all data]
Weast and Grasselli, 1989
CRC Handbook of Data on Organic Compounds, 2nd Editon, Weast,R.C and Grasselli, J.G., ed(s)., CRC Press, Inc., Boca Raton, FL, 1989, 1. [all data]
Zenkevich, 2001
Zenkevich, I.G.,
Encyclopedia of Chromatography. Derivatization of Amines, Amino Acids, Amides and Imides for GC Analysis, Marcel Dekker, Inc, New York - Basel, 2001, 224. [all data]